{"text_format":"1","workbook":"xlsx","n_sheets":5,"sheets":["Menu","School List","DFES","Notification","School Closing Balances 2022-23"],"not_rendered":{"charts":0,"images":3,"macros":1,"external_links":10,"defined_names":171,"comments":0,"pivot_tables":0},"unopened":[],"bounds":{"document_bytes":16777216,"sheet_cells":100000,"rows_first":2000,"rows_last":500,"rows_between":2000,"halvings":0,"cell_chars":16384,"cell_head_chars":4096},"cells_cut":0,"cells_raw":0,"read":"whole","date_system":"1900"}

{"sheet":"Menu","index":0,"n_rows":262,"n_cols":13,"rows_kept":262,"cut":false,"hidden":false,"merged":[]}
[null,null,null,{"$f":"IF(ISNA(VLOOKUP(E1,A100:$B$500,2,0)),0,VLOOKUP(E1,A100:$B$500,2,0))","v":2479},{"$f":"+DFES!E1","v":2479}]
[]
[]
[]
[]
[]
[]
[]
[]
[null,"2022/23 Calculation of Non Cheque Book/EPA Schools In Year and Carried Forward Revenue Balances"]
[null,"Please Left Click on the Macro Button below to continue."]
[null,"If the aforementioned does not function, please refer to the Macro Guidance from this link:",null,null,null,null,null,null,null,null,null,null,"Macro guidance"]
[null,"Should the Protected View message be visible on the Toolbar, click on Enable Editing."]
[]
[]
[]
[]
[]
[]
[]
[]
[]
[]
[]
[]
[]
[]
[]
[]
[]
[]
[]
[]
[]
[]
[]
[]
[]
[]
[]
{"$rows_left_out":223}
{"sheet":"School List","index":1,"n_rows":168,"n_cols":79,"rows_kept":168,"cut":false,"hidden":true,"merged":[[0,3,6,3],[0,4,4,4]]}
[null,null,null,null,null,null,null,null,null,null,null,null,null,null,null,null,null,null,null,null,null,null,null,null,null,null,null,null,null,null,null,null,null,null,null,null,null,null,null,null,null,null,null,null,null,null,null,null,null,null,null,null,null,null,null,null,null,null,null,null,null,null,null,null,null,null,null,null,null,null,null,null,null,null,null,null,null,null,"ok"]
[]
[]
["DFE"]
["Number",null,"Name"]
[1027,null,"Adderley Nursery School"]
[5949,null,"Al-Furqan Primary School"]
[2153,null,"Allens Croft Primary School"]
[2062,null,"Anderton Park Primary School"]
[2479,null,"Anglesey Primary School"]
[2300,null,"Arden Primary School"]
[2014,null,"Barford Primary School"]
[7016,null,"Baskerville School"]
[7052,null,"Beaufort School"]
[2017,null,"Beeches Infant School"]
[2016,null,"Beeches Junior School"]
[2239,null,"Bellfield Infant School (NC)"]
[2241,null,"Bellfield Junior School"]
[2456,null,"Bells Farm Primary School"]
[2435,null,"Benson Community School"]
[1025,null,"Bloomsbury Nursery School"]
[1001,null,"Bordesley Green East Nursery School"]
[3353,null,"Bournville Village Primary"]
[7030,null,"Braidwood School for the Deaf"]
[1002,null,"Brearley Nursery School"]
[2465,null,"Calshot Primary School"]
[1048,null,"Castle Vale Nursery School"]
[2040,null,"Cherry Orchard Primary School"]
[1100,null,"City of Birmingham School"]
[3432,null,"Clifton Primary School"]
[2289,null,"Cofton Primary School"]
[2185,null,"Colebourne Primary School"]
[2464,null,"Coppice Primary School"]
[3320,null,"Corpus Christi Catholic Primary School"]
[2055,null,"Cotteridge Primary School"]
[2191,null,"Court Farm Primary School"]
[2284,null,"Deykin Avenue Junior and Infant School"]
[1802,null,"Edith Cadbury Nursery School"]
[2454,null,"Elms Farm Community Primary School"]
[3321,null,"English Martyrs' Catholic Primary School"]
{"$rows_left_out":129}
{"sheet":"DFES","index":2,"n_rows":183,"n_cols":29,"rows_kept":183,"cut":false,"hidden":true,"merged":[]}
[1027,"AX001","Adderley Nursery School",null,2479,{"$f":"IF(ISNA(VLOOKUP($E$1,$A$1:$C$329,3,0)),0,VLOOKUP($E$1,$A$1:$C$329,3,0))","v":"Anglesey Primary School"},null,null,null,null,null,null,null,null,null,null,null,null,null,null,null,null,null,null,null,"2011/12","2010/11","January 2011 CENSUS","January 2010 CENSUS"]
[5949,"AX002","Al-Furqan Primary School"]
[2153,"AX004","Allens Croft Primary School"]
[2062,"AX006","Anderton Park Primary School"]
[2479,"AX007","Anglesey Primary School"]
[2300,"AX008","Arden Primary School"]
[2014,"AX00C","Barford Primary School"]
[7016,"AX00E","Baskerville School"]
[7052,"AX00F","Beaufort School"]
[2017,"AX04L","Beeches Infant School"]
[2016,"AX04M","Beeches Junior School"]
[2239,"AX00G","Bellfield Infant School (NC)"]
[2241,"AX00H","Bellfield Junior School"]
[2456,"AX00J","Bells Farm Primary School"]
[2435,"AX00K","Benson Community School"]
[1025,"AX00R","Bloomsbury Nursery School"]
[1001,"AX00U","Bordesley Green East Nursery School"]
[3353,"AX00X","Bournville Village Primary"]
[7030,"AX00Y","Braidwood School for the Deaf"]
[1002,"AX00Z","Brearley Nursery School"]
[2465,"AX013","Calshot Primary School"]
[1048,"AX014","Castle Vale Nursery School"]
[2040,"AX018","Cherry Orchard Primary School"]
[1100,"AX073","City of Birmingham School"]
[3432,"AX01B","Clifton Primary School"]
[2289,"AX01D","Cofton Primary School"]
[2185,"AX01E","Colebourne Primary School"]
[2464,"AX01G","Coppice Primary School"]
[3320,"AX01H","Corpus Christi Catholic Primary School"]
[2055,"AX01J","Cotteridge Primary School"]
[2191,"AX01L","Court Farm Primary School"]
[2284,"AX01N","Deykin Avenue Junior and Infant School"]
[1802,"AX01Q","Edith Cadbury Nursery School"]
[2454,"AX01R","Elms Farm Community Primary School"]
[3321,"AX01T","English Martyrs' Catholic Primary School"]
[1026,"AX01X","Featherstone Nursery School"]
[2294,"AX01W","Featherstone Primary School"]
[2486,"AX01Z","Forestdale Primary School"]
[3435,"AX020","Four Oaks Primary School"]
[7050,"AX021","Fox Hollies School"]
{"$rows_left_out":144}
{"sheet":"Notification","index":3,"n_rows":44,"n_cols":6,"rows_kept":44,"cut":false,"hidden":true,"merged":[]}
[null,null,null,null,null,{"$f":"+DFES!$E$1","v":2479}]
[]
[null,"2022/23 School Carry Forward and In Year Balance Notification"]
[]
[null,"School:",null,{"$f":"+DFES!$F$1","v":"Anglesey Primary School"}]
[null,"DFE No:",null,{"$f":"+DFES!$E$1","v":2479}]
[]
[]
[]
[]
[]
[]
[]
[]
[]
[]
[null,"School:",{"$f":"$D$5","v":"Anglesey Primary School"}]
[]
[null,"For the attention of the Headteacher"]
[]
[null,"Dear Sir or Madam"]
[]
[null,"Calculation of the School's In Year and Carried Forward Revenue Balances"]
[]
[null,"The Local Authority has closed the accounts of your school as at 31st March 2023 and"]
[null,"I confirm that the school's surplus / (deficit) revenue balances have been determined as follows:"]
[]
[null,"Brought Forward Revenue Surplus / (Deficit) Balance as at 1st April 2022"]
[]
[null,null,"£",{"$f":"-IF(ISNA(VLOOKUP(DFES!$E$1,'School Closing Balances 2022-23'!$E$3:$J$220,4,0)),0,VLOOKUP(DFES!$E$1,'School Closing Balances 2022-23'!$E$3:$J$220,4,0))","v":606379.33572653984}]
[]
[]
[null,"In Year Revenue Surplus / (Deficit) for the Financial Year 2022-23"]
[]
[null,null,"£",{"$f":"-IF(ISNA(VLOOKUP(DFES!$E$1,'School Closing Balances 2022-23'!$E$3:$J$220,5,0)),0,VLOOKUP(DFES!$E$1,'School Closing Balances 2022-23'!$E$3:$J$220,5,0))","v":185311.45999999915}]
[]
[]
[null,"Carried Forward Revenue Surplus / (Deficit) Balance as at 31st March 2023"]
[]
[null,null,"£",{"$f":"-IF(ISNA(VLOOKUP(DFES!$E$1,'School Closing Balances 2022-23'!$E$3:$J$220,6,0)),0,VLOOKUP(DFES!$E$1,'School Closing Balances 2022-23'!$E$3:$J$220,6,0))","v":791690.79572653899}]
{"$rows_left_out":5}
{"sheet":"School Closing Balances 2022-23","index":4,"n_rows":222,"n_cols":17,"rows_kept":222,"cut":false,"hidden":true,"merged":[[0,7,0,9],[0,11,0,13],[0,14,0,16]]}
["Schools Closing Balances",null,"2022-23",null,null,null,"*Please note: Negatives are surpluses","Revenue",null,null,null,"DEVOLVED CAPITAL",null,null,"ENERGY EFFICIENCY GRANT"]
[null,null,null,null,null,null,null,"Opening","In-year","Published C/Fwd",null,"Opening","In-year","Closing","Opening","In-year","Closing"]
["Oracle Cost Centre","Type","SAP","LA No","DFE No","School Number","School Name","Balance","(Surplus)/Defict","after Adjustment",null,"Balance","(Surplus)/Defict","Balance","Balance","(Surplus)/Defict","Balance"]
["AX001",{"$f":"_xlfn.XLOOKUP(A4,[9]Sheet2!A:A,[9]Sheet2!D:D,0,FALSE)","v":"EPA"},"REAYW",330,1027,3301027,"ADDERLEY Nurs",148341.2979798984,-145919.40000000008,2421.89797989832,null,-5114.6999999999989,-4864,-9978.6999999999989,{"$f":"-_xlfn.XLOOKUP(A4,[10]Capital!B:B,[10]Capital!AG:AG,0,FALSE)","v":-11540.61},{"$f":"_xlfn.XLOOKUP(A4,[10]Capital!B:B,[10]Capital!AH:AH,0,FALSE)","v":0},{"$f":"O4+P4","v":-11540.61}]
["AX00U",{"$f":"_xlfn.XLOOKUP(A5,[9]Sheet2!A:A,[9]Sheet2!D:D,0,FALSE)","v":"EPA"},"REAYZ",330,1001,3301001,"BORDESLEY GREEN Nurs",13592.322119036864,10582.689999999944,24175.012119036808,null,-21804.730000000003,-4472.5,-26277.230000000003,{"$f":"-_xlfn.XLOOKUP(A5,[10]Capital!B:B,[10]Capital!AG:AG,0,FALSE)","v":-10842.52},{"$f":"_xlfn.XLOOKUP(A5,[10]Capital!B:B,[10]Capital!AH:AH,0,FALSE)","v":0},{"$f":"O5+P5","v":-10842.52}]
["AX01Q",{"$f":"_xlfn.XLOOKUP(A6,[9]Sheet2!A:A,[9]Sheet2!D:D,0,FALSE)","v":"EPA"},"REAYF",330,1802,3301802,"EDITH CADBURY Nrsy ",48973.267432412074,-5790.859999999986,43182.407432412088,null,-9212.4399999999987,-4560.25,-13772.689999999999,{"$f":"-_xlfn.XLOOKUP(A6,[10]Capital!B:B,[10]Capital!AG:AG,0,FALSE)","v":-10998.99},{"$f":"_xlfn.XLOOKUP(A6,[10]Capital!B:B,[10]Capital!AH:AH,0,FALSE)","v":0},-10998.99]
["AX07D",{"$f":"_xlfn.XLOOKUP(A7,[9]Sheet2!A:A,[9]Sheet2!D:D,0,FALSE)","v":"EPA"},"REAZW",330,1019,3301019,"WASHWOOD HEATH Nurs",349750.60395450948,34312.489999999991,384063.09395450947,null,-29669.64,-5080,-34749.64,{"$f":"-_xlfn.XLOOKUP(A7,[10]Capital!B:B,[10]Capital!AG:AG,0,FALSE)","v":-11925.76},{"$f":"_xlfn.XLOOKUP(A7,[10]Capital!B:B,[10]Capital!AH:AH,0,FALSE)","v":0},-11925.76]
["AX004",{"$f":"_xlfn.XLOOKUP(A8,[9]Sheet2!A:A,[9]Sheet2!D:D,0,FALSE)","v":"EPA"},"REAAH",330,2153,3302153,"ALLENS CROFT JI ",-860880.02028289856,663560.11999999871,-197319.90028289985,null,-12460.96,29702.75,17241.79,{"$f":"-_xlfn.XLOOKUP(A8,[10]Capital!B:B,[10]Capital!AG:AG,0,FALSE)","v":-17241.66},{"$f":"_xlfn.XLOOKUP(A8,[10]Capital!B:B,[10]Capital!AH:AH,0,FALSE)","v":0},-17241.66]
["AX007",{"$f":"_xlfn.XLOOKUP(A9,[9]Sheet2!A:A,[9]Sheet2!D:D,0,FALSE)","v":"EPA"},"REAAM",330,2479,3302479,"ANGLESEY JI NC",-606379.33572653984,-185311.45999999915,-791690.79572653899,null,-12241.75,9987.56,-2254.1900000000005,{"$f":"-_xlfn.XLOOKUP(A9,[10]Capital!B:B,[10]Capital!AG:AG,0,FALSE)","v":-24362.959999999999},{"$f":"_xlfn.XLOOKUP(A9,[10]Capital!B:B,[10]Capital!AH:AH,0,FALSE)","v":0},-24362.959999999999]
["AX00G",{"$f":"_xlfn.XLOOKUP(A10,[9]Sheet2!A:A,[9]Sheet2!D:D,0,FALSE)","v":"EPA"},"REAAY",330,2239,3302239,"BELLFIELD I NC",-262055.40131685766,123894.55000000008,-138160.85131685759,null,-10744.399999999994,1242.3099999999995,-9502.0899999999947,{"$f":"-_xlfn.XLOOKUP(A10,[10]Capital!B:B,[10]Capital!AG:AG,0,FALSE)","v":-13711.1},{"$f":"_xlfn.XLOOKUP(A10,[10]Capital!B:B,[10]Capital!AH:AH,0,FALSE)","v":0},-13711.1]
["AX00K",{"$f":"_xlfn.XLOOKUP(A11,[9]Sheet2!A:A,[9]Sheet2!D:D,0,FALSE)","v":"EPA"},"REABB",330,2435,3302435,"BENSON JI NC",-587426.94549374538,132123.91000000155,-455303.03549374384,null,-5685.6899999999878,-8798.1200000000008,-14483.809999999989,{"$f":"-_xlfn.XLOOKUP(A11,[10]Capital!B:B,[10]Capital!AG:AG,0,FALSE)","v":-18555.59},{"$f":"_xlfn.XLOOKUP(A11,[10]Capital!B:B,[10]Capital!AH:AH,0,FALSE)","v":0},-18555.59]
["AX013",{"$f":"_xlfn.XLOOKUP(A12,[9]Sheet2!A:A,[9]Sheet2!D:D,0,FALSE)","v":"EPA"},"REACB",330,2465,3302465,"CALSHOT JI NC",-64328.774966962847,-28093.150000000947,-92421.924966963794,null,-10528.830000000005,13722.96,3194.1299999999937,{"$f":"-_xlfn.XLOOKUP(A12,[10]Capital!B:B,[10]Capital!AG:AG,0,FALSE)","v":-18786.28},{"$f":"_xlfn.XLOOKUP(A12,[10]Capital!B:B,[10]Capital!AH:AH,0,FALSE)","v":0},-18786.28]
["AX018",{"$f":"_xlfn.XLOOKUP(A13,[9]Sheet2!A:A,[9]Sheet2!D:D,0,FALSE)","v":"EPA"},"REACF",330,2040,3302040,"CHERRY ORCHARD JI NC",-112202.05401923822,118629.57000000076,6427.515980762546,null,0,-7060.0599999999977,-7060.0599999999977,{"$f":"-_xlfn.XLOOKUP(A13,[10]Capital!B:B,[10]Capital!AG:AG,0,FALSE)","v":-19203.53},{"$f":"_xlfn.XLOOKUP(A13,[10]Capital!B:B,[10]Capital!AH:AH,0,FALSE)","v":0},-19203.53]
["AX01B",{"$f":"_xlfn.XLOOKUP(A14,[9]Sheet2!A:A,[9]Sheet2!D:D,0,FALSE)","v":"EPA"},"REACN",330,3432,3303432,"CLIFTON JI NC",-654009.86535320012,317278.11999999918,-336731.74535320094,null,-1364.4299999999894,-9820.25,-11184.679999999989,{"$f":"-_xlfn.XLOOKUP(A14,[10]Capital!B:B,[10]Capital!AG:AG,0,FALSE)","v":-26886.51},{"$f":"_xlfn.XLOOKUP(A14,[10]Capital!B:B,[10]Capital!AH:AH,0,FALSE)","v":0},-26886.51]
["AX01E",{"$f":"_xlfn.XLOOKUP(A15,[9]Sheet2!A:A,[9]Sheet2!D:D,0,FALSE)","v":"EPA"},"REACQ",330,2185,3302185,"COLEBOURNE JI ",-233913.24908272631,10249.52000000095,-223663.72908272536,null,-9116.489999999998,-9087.25,-18203.739999999998,{"$f":"-_xlfn.XLOOKUP(A15,[10]Capital!B:B,[10]Capital!AG:AG,0,FALSE)","v":-19071.13},{"$f":"_xlfn.XLOOKUP(A15,[10]Capital!B:B,[10]Capital!AH:AH,0,FALSE)","v":0},-19071.13]
["AX01G",{"$f":"_xlfn.XLOOKUP(A16,[9]Sheet2!A:A,[9]Sheet2!D:D,0,FALSE)","v":"EPA"},"REACY",330,2464,3302464,"COPPICE JI ",-91418.274286986591,332044.66999999993,240626.39571301333,null,-3275.2099999999991,2915.75,-359.45999999999913,{"$f":"-_xlfn.XLOOKUP(A16,[10]Capital!B:B,[10]Capital!AG:AG,0,FALSE)","v":-18445.259999999998},{"$f":"_xlfn.XLOOKUP(A16,[10]Capital!B:B,[10]Capital!AH:AH,0,FALSE)","v":0},-18445.259999999998]
["AX01R",{"$f":"_xlfn.XLOOKUP(A17,[9]Sheet2!A:A,[9]Sheet2!D:D,0,FALSE)","v":"EPA"},"READJ",330,2454,3302454,"ELMS FARM JI NC",-356218.38659480005,-90989.540000000503,-447207.92659480055,null,-11307.289999999999,1380.3799999999992,-9926.91,{"$f":"-_xlfn.XLOOKUP(A17,[10]Capital!B:B,[10]Capital!AG:AG,0,FALSE)","v":-17049.080000000002},{"$f":"_xlfn.XLOOKUP(A17,[10]Capital!B:B,[10]Capital!AH:AH,0,FALSE)","v":0},-17049.080000000002]
["AX01T",{"$f":"_xlfn.XLOOKUP(A18,[9]Sheet2!A:A,[9]Sheet2!D:D,0,FALSE)","v":"EPA"},"READK",330,3321,3303321,"ENGLISH MARTYRS RC JI ",-344067.62957499252,141066.84999999916,-203000.77957499336,null,0,0,0,{"$f":"-_xlfn.XLOOKUP(A18,[10]Capital!B:B,[10]Capital!AG:AG,0,FALSE)","v":0},{"$f":"_xlfn.XLOOKUP(A18,[10]Capital!B:B,[10]Capital!AH:AH,0,FALSE)","v":0},0]
["AX020",{"$f":"_xlfn.XLOOKUP(A19,[9]Sheet2!A:A,[9]Sheet2!D:D,0,FALSE)","v":"EPA"},"READX",330,3435,3303435,"FOUR OAKS JI ",-198865.28561240673,23160.799999999348,-175704.48561240738,null,-25504.80999999999,4495.2999999999993,-21009.509999999991,{"$f":"-_xlfn.XLOOKUP(A19,[10]Capital!B:B,[10]Capital!AG:AG,0,FALSE)","v":-18445.259999999998},{"$f":"_xlfn.XLOOKUP(A19,[10]Capital!B:B,[10]Capital!AH:AH,0,FALSE)","v":0},-18445.259999999998]
["AX026",{"$f":"_xlfn.XLOOKUP(A20,[9]Sheet2!A:A,[9]Sheet2!D:D,0,FALSE)","v":"EPA"},"REAEA",330,2081,3302081,"GILBERTSTONE JI NC",-143141.85573965835,78126.899999999616,-65014.955739658741,null,-16871.449999999993,-8587.75,-25459.199999999993,{"$f":"-_xlfn.XLOOKUP(A20,[10]Capital!B:B,[10]Capital!AG:AG,0,FALSE)","v":-18180.47},{"$f":"_xlfn.XLOOKUP(A20,[10]Capital!B:B,[10]Capital!AH:AH,0,FALSE)","v":0},-18180.47]
["AX02G",{"$f":"_xlfn.XLOOKUP(A21,[9]Sheet2!A:A,[9]Sheet2!D:D,0,FALSE)","v":"EPA"},"REAEN",330,2093,3302093,"HALL GREEN I NC",-271201.66842712724,-6037.5100000005914,-277239.17842712783,null,-36475.08,-8356,-44831.08,{"$f":"-_xlfn.XLOOKUP(A21,[10]Capital!B:B,[10]Capital!AG:AG,0,FALSE)","v":-17767.23},{"$f":"_xlfn.XLOOKUP(A21,[10]Capital!B:B,[10]Capital!AH:AH,0,FALSE)","v":0},-17767.23]
["AX02M",{"$f":"_xlfn.XLOOKUP(A22,[9]Sheet2!A:A,[9]Sheet2!D:D,0,FALSE)","v":"EPA"},"REAEW",330,2099,3302099,"HAWTHORN JI ",-276063.65140764031,36895.790000000212,-239167.8614076401,null,-9548.630000000001,5125.5,-4423.130000000001,{"$f":"-_xlfn.XLOOKUP(A22,[10]Capital!B:B,[10]Capital!AG:AG,0,FALSE)","v":-14501.46},{"$f":"_xlfn.XLOOKUP(A22,[10]Capital!B:B,[10]Capital!AH:AH,0,FALSE)","v":0},-14501.46]
["AX03E",{"$f":"_xlfn.XLOOKUP(A23,[9]Sheet2!A:A,[9]Sheet2!D:D,0,FALSE)","v":"EPA"},"REAGE",330,2189,3302189,"LADYPOOL JI NC",-96107.14656045787,-39896.980000000229,-136004.1265604581,null,-13325,-7892.5,-21217.5,{"$f":"-_xlfn.XLOOKUP(A23,[10]Capital!B:B,[10]Capital!AG:AG,0,FALSE)","v":-16940.759999999998},{"$f":"_xlfn.XLOOKUP(A23,[10]Capital!B:B,[10]Capital!AH:AH,0,FALSE)","v":0},-16940.759999999998]
["AX03F",{"$f":"_xlfn.XLOOKUP(A24,[9]Sheet2!A:A,[9]Sheet2!D:D,0,FALSE)","v":"EPA"},"REAGF",330,2119,3302119,"LAKEY LANE JI NC",-4139.5339788249548,91181.010000000824,87041.476021175869,null,-12268.900000000003,11757.939999999999,-510.96000000000458,{"$f":"-_xlfn.XLOOKUP(A24,[10]Capital!B:B,[10]Capital!AG:AG,0,FALSE)","v":-18726.099999999999},{"$f":"_xlfn.XLOOKUP(A24,[10]Capital!B:B,[10]Capital!AH:AH,0,FALSE)","v":0},-18726.099999999999]
["AX03Q",{"$f":"_xlfn.XLOOKUP(A25,[9]Sheet2!A:A,[9]Sheet2!D:D,0,FALSE)","v":"EPA"},"REAGP",330,2420,3302420,"MANEY HILL JI ",-406384.29988325853,98924.240000000224,-307460.05988325831,null,-29336.819999999996,-5656.25,-34993.069999999992,{"$f":"-_xlfn.XLOOKUP(A25,[10]Capital!B:B,[10]Capital!AG:AG,0,FALSE)","v":-17843.46},{"$f":"_xlfn.XLOOKUP(A25,[10]Capital!B:B,[10]Capital!AH:AH,0,FALSE)","v":0},-17843.46]
["AX040",{"$f":"_xlfn.XLOOKUP(A26,[9]Sheet2!A:A,[9]Sheet2!D:D,0,FALSE)","v":"EPA"},"REAHC",330,2406,3302406,"MINWORTH JI ",-210915.62274005645,-69380.700000000448,-280296.3227400569,null,-47270.35,-27077.06,-74347.41,{"$f":"-_xlfn.XLOOKUP(A26,[10]Capital!B:B,[10]Capital!AG:AG,0,FALSE)","v":-14152.42},{"$f":"_xlfn.XLOOKUP(A26,[10]Capital!B:B,[10]Capital!AH:AH,0,FALSE)","v":0},-14152.42]
["AX04A",{"$f":"_xlfn.XLOOKUP(A27,[9]Sheet2!A:A,[9]Sheet2!D:D,0,FALSE)","v":"EPA"},"REAHY",330,2436,3302436,"OSBORNE JI ",0,0,0,null,-9592.4300000000021,0,-9592.4300000000021,{"$f":"-_xlfn.XLOOKUP(A27,[10]Capital!B:B,[10]Capital!AG:AG,0,FALSE)","v":0},{"$f":"_xlfn.XLOOKUP(A27,[10]Capital!B:B,[10]Capital!AH:AH,0,FALSE)","v":0},0]
["AX04D",{"$f":"_xlfn.XLOOKUP(A28,[9]Sheet2!A:A,[9]Sheet2!D:D,0,FALSE)","v":"EPA"},"REAHZ",330,3351,3303351,"OUR LADY AND ST ROSE RC JI NC",-167375.58724562451,-7794.5600000002887,-175170.1472456248,null,0,0,0,{"$f":"-_xlfn.XLOOKUP(A28,[10]Capital!B:B,[10]Capital!AG:AG,0,FALSE)","v":0},{"$f":"_xlfn.XLOOKUP(A28,[10]Capital!B:B,[10]Capital!AH:AH,0,FALSE)","v":0},0]
["AX04E",{"$f":"_xlfn.XLOOKUP(A29,[9]Sheet2!A:A,[9]Sheet2!D:D,0,FALSE)","v":"EPA"},"REAJB",330,3328,3303328,"OUR LADY OF LOURDES RC JI NC",-233425.31743972193,-68914.859999999782,-302340.17743972171,null,0,-109.72,-109.72,{"$f":"-_xlfn.XLOOKUP(A29,[10]Capital!B:B,[10]Capital!AG:AG,0,FALSE)","v":0},{"$f":"_xlfn.XLOOKUP(A29,[10]Capital!B:B,[10]Capital!AH:AH,0,FALSE)","v":0},0]
["AX04G",{"$f":"_xlfn.XLOOKUP(A30,[9]Sheet2!A:A,[9]Sheet2!D:D,0,FALSE)","v":"EPA"},"REAJE",330,2021,3302021,"PAGANEL JI NC",-390955.51163991273,25503.740000000689,-365451.77163991204,null,-34544.180000000008,4052.12,-30492.060000000009,{"$f":"-_xlfn.XLOOKUP(A30,[10]Capital!B:B,[10]Capital!AG:AG,0,FALSE)","v":-17203.55},{"$f":"_xlfn.XLOOKUP(A30,[10]Capital!B:B,[10]Capital!AH:AH,0,FALSE)","v":0},-17203.55]
["AX04Y",{"$f":"_xlfn.XLOOKUP(A31,[9]Sheet2!A:A,[9]Sheet2!D:D,0,FALSE)","v":"EPA"},"REAKB",330,2160,3302160,"REDNAL HILL J ",-258616.67865053291,-24574.480000000913,-283191.15865053382,null,-11346.940000000002,5838.9500000000007,-5507.9900000000016,{"$f":"-_xlfn.XLOOKUP(A31,[10]Capital!B:B,[10]Capital!AG:AG,0,FALSE)","v":-17061.12},{"$f":"_xlfn.XLOOKUP(A31,[10]Capital!B:B,[10]Capital!AH:AH,0,FALSE)","v":0},-17061.12]
["AX04Z",{"$f":"_xlfn.XLOOKUP(A32,[9]Sheet2!A:A,[9]Sheet2!D:D,0,FALSE)","v":"EPA"},"REAKC",330,2063,3302063,"REGENTS PARK JI NC",-227057.20182335723,68324.16999999946,-158733.03182335777,null,-29994.93,-10318,-40312.93,{"$f":"-_xlfn.XLOOKUP(A32,[10]Capital!B:B,[10]Capital!AG:AG,0,FALSE)","v":-21265.7},{"$f":"_xlfn.XLOOKUP(A32,[10]Capital!B:B,[10]Capital!AH:AH,0,FALSE)","v":0},-21265.7]
["AX055",{"$f":"_xlfn.XLOOKUP(A33,[9]Sheet2!A:A,[9]Sheet2!D:D,0,FALSE)","v":"EPA"},"REAKL",330,2008,3302008,"SHAW HILL JI NC",-344457.51182158536,63181.459999999905,-281276.05182158545,null,-2535.5699999999997,-9058,-11593.57,{"$f":"-_xlfn.XLOOKUP(A33,[10]Capital!B:B,[10]Capital!AG:AG,0,FALSE)","v":-19018.98},{"$f":"_xlfn.XLOOKUP(A33,[10]Capital!B:B,[10]Capital!AH:AH,0,FALSE)","v":0},-19018.98]
["AX059",{"$f":"_xlfn.XLOOKUP(A34,[9]Sheet2!A:A,[9]Sheet2!D:D,0,FALSE)","v":"EPA"},"REAKT",330,2176,3302176,"SOMERVILLE JI NC",-266346.95514552214,14776.730000001378,-251570.22514552076,null,-33722.540000000008,-11944.75,-45667.290000000008,{"$f":"-_xlfn.XLOOKUP(A34,[10]Capital!B:B,[10]Capital!AG:AG,0,FALSE)","v":-24166.37},{"$f":"_xlfn.XLOOKUP(A34,[10]Capital!B:B,[10]Capital!AH:AH,0,FALSE)","v":0},-24166.37]
["AX05D",{"$f":"_xlfn.XLOOKUP(A35,[9]Sheet2!A:A,[9]Sheet2!D:D,0,FALSE)","v":"EPA"},"REAKY",330,3380,3303380,"ST AMBROSE BARLOW RC JI ",-175282.95714392813,110136.03000000003,-65146.9271439281,null,0,0,0,{"$f":"-_xlfn.XLOOKUP(A35,[10]Capital!B:B,[10]Capital!AG:AG,0,FALSE)","v":0},{"$f":"_xlfn.XLOOKUP(A35,[10]Capital!B:B,[10]Capital!AH:AH,0,FALSE)","v":0},0]
["AX05E",{"$f":"_xlfn.XLOOKUP(A36,[9]Sheet2!A:A,[9]Sheet2!D:D,0,FALSE)","v":"EPA"},"REALA",330,3335,3303335,"ST ANNE'S RC JI ",-6449.2632705775904,-34843.449999999488,-41292.713270577078,null,0,0,0,{"$f":"-_xlfn.XLOOKUP(A36,[10]Capital!B:B,[10]Capital!AG:AG,0,FALSE)","v":0},{"$f":"_xlfn.XLOOKUP(A36,[10]Capital!B:B,[10]Capital!AH:AH,0,FALSE)","v":0},0]
["AX05J",{"$f":"_xlfn.XLOOKUP(A37,[9]Sheet2!A:A,[9]Sheet2!D:D,0,FALSE)","v":"EPA"},"REALE",330,3372,3303372,"ST BERNADETTE'S RC JI NC",-325046.37858739425,-29021.859999999404,-354068.23858739366,null,0,0,0,{"$f":"-_xlfn.XLOOKUP(A37,[10]Capital!B:B,[10]Capital!AG:AG,0,FALSE)","v":0},{"$f":"_xlfn.XLOOKUP(A37,[10]Capital!B:B,[10]Capital!AH:AH,0,FALSE)","v":0},0]
["AX05U",{"$f":"_xlfn.XLOOKUP(A38,[9]Sheet2!A:A,[9]Sheet2!D:D,0,FALSE)","v":"EPA"},"REALR",330,3355,3303355,"ST EDWARD'S RC JI ",-159010.51887721228,-6432.0099999997765,-165442.52887721205,null,0,0,0,{"$f":"-_xlfn.XLOOKUP(A38,[10]Capital!B:B,[10]Capital!AG:AG,0,FALSE)","v":0},{"$f":"_xlfn.XLOOKUP(A38,[10]Capital!B:B,[10]Capital!AH:AH,0,FALSE)","v":0},0]
["AX05Y",{"$f":"_xlfn.XLOOKUP(A39,[9]Sheet2!A:A,[9]Sheet2!D:D,0,FALSE)","v":"EPA"},"REALY",330,3367,3303367,"ST GERARD'S RC JI NC",-178624.09912088796,58085.229999999749,-120538.86912088821,null,0,0,0,{"$f":"-_xlfn.XLOOKUP(A39,[10]Capital!B:B,[10]Capital!AG:AG,0,FALSE)","v":0},{"$f":"_xlfn.XLOOKUP(A39,[10]Capital!B:B,[10]Capital!AH:AH,0,FALSE)","v":0},0]
["AX061",{"$f":"_xlfn.XLOOKUP(A40,[9]Sheet2!A:A,[9]Sheet2!D:D,0,FALSE)","v":"EPA"},"REAMB",330,3410,3303410,"ST JOHN & ST MONICA RC JI ",-232746.90177916182,65731.519999999786,-167015.38177916204,null,0,0,0,{"$f":"-_xlfn.XLOOKUP(A40,[10]Capital!B:B,[10]Capital!AG:AG,0,FALSE)","v":0},{"$f":"_xlfn.XLOOKUP(A40,[10]Capital!B:B,[10]Capital!AH:AH,0,FALSE)","v":0},0]
{"$rows_left_out":182}