{"text_format":"1","workbook":"xlsx","n_sheets":6,"sheets":["Menu","School List","DFES","Notification","Total","School Closing Balances 2022-23"],"not_rendered":{"charts":0,"images":3,"macros":1,"external_links":10,"defined_names":172,"comments":0,"pivot_tables":0},"unopened":[],"bounds":{"document_bytes":16777216,"sheet_cells":100000,"rows_first":2000,"rows_last":500,"rows_between":2000,"halvings":0,"cell_chars":16384,"cell_head_chars":4096},"cells_cut":0,"cells_raw":0,"read":"whole","date_system":"1900"}

{"sheet":"Menu","index":0,"n_rows":153,"n_cols":13,"rows_kept":153,"cut":false,"hidden":false,"merged":[]}
[null,null,null,{"$f":"IF(ISNA(VLOOKUP(E1,A100:$B$500,2,0)),0,VLOOKUP(E1,A100:$B$500,2,0))","v":1017},{"$f":"+DFES!E1","v":1017}]
[]
[]
[]
[]
[]
[]
[]
[]
[null,"2022/23 Calculation of Cheque Book Schools In Year and Carried Forward Revenue Balances"]
[null,"Please Left Click on the Macro Button below to continue."]
[null,"If the aforementioned does not function, please refer to the Macro Guidance from this link:",null,null,null,null,null,null,null,null,null,null,"Macro guidance"]
[null,"Should the Protected View message be visible on the Toolbar, click on Enable Editing."]
[]
[]
[]
[]
[]
[]
[]
[]
[]
[]
[]
[]
[]
[]
[]
[]
[]
{"$rows_left_out":124}
{"sheet":"School List","index":1,"n_rows":59,"n_cols":79,"rows_kept":59,"cut":false,"hidden":true,"merged":[[0,3,6,3],[0,4,4,4]]}
[null,null,null,null,null,null,null,null,null,null,null,null,null,null,null,null,null,null,null,null,null,null,null,null,null,null,null,null,null,null,null,null,null,null,null,null,null,null,null,null,null,null,null,null,null,null,null,null,null,null,null,null,null,null,null,null,null,null,null,null,null,null,null,null,null,null,null,null,null,null,null,null,null,null,null,null,null,null,"ok"]
[]
[]
["DFE"]
["Number",null,"Name"]
[2010,null,"Adderley Primary School"]
[1017,null,"Allens Croft Nursery School"]
[5413,null,"Bishop Challoner Catholic College"]
[2254,null,"Blakesley Hall Primary School"]
[2402,null,"Boldmere Infant School and Nursery"]
[2401,null,"Boldmere Junior School"]
[4115,null,"Bordesley Green Girls' Sch & Sixth Form"]
[2030,null,"Bordesley Green Primary School"]
[2238,null,"Broadmeadow Infant School"]
[2236,null,"Broadmeadow Junior School"]
[4801,null,"Cardinal Wiseman Catholic School"]
[2312,null,"Chad Vale Primary School"]
[7051,null,"Cherry Oak School"]
[2251,null,"Chilcote Primary School"]
[3002,null,"Christ Church CofE Primary Sch & Nursery"]
[3319,null,"Christ The King Catholic Primary School"]
[5416,null,"Colmers School and Sixth Form College"]
[2054,null,"Colmore Infant and Nursery School"]
[2053,null,"Colmore Junior School"]
[2296,null,"Glenmead Primary School"]
[2092,null,"Hall Green Junior School"]
[4201,null,"Hodge Hill College"]
[4015,null,"Hodge Hill Girls' School"]
[4223,null,"Holte School"]
[2015,null,"James Watt Primary School"]
{"$rows_left_out":30}
{"sheet":"DFES","index":2,"n_rows":72,"n_cols":29,"rows_kept":72,"cut":false,"hidden":true,"merged":[]}
[2010,"AX085","Adderley Primary School",null,1017,{"$f":"IF(ISNA(VLOOKUP($E$1,$A$1:$C$72,3,0)),0,VLOOKUP($E$1,$A$1:$C$72,3,0))","v":"Allens Croft Nursery School"},null,null,null,null,null,null,null,null,null,null,null,null,null,null,null,null,null,null,null,"2011/12","2010/11","January 2011 CENSUS","January 2010 CENSUS"]
[1017,"AX087","Allens Croft Nursery School"]
[5413,"AX08C","Bishop Challoner Catholic College"]
[2254,"AX00Q","Blakesley Hall Primary School"]
[2402,"AX08G","Boldmere Infant School and Nursery"]
[2401,"AX00T","Boldmere Junior School"]
[4115,"AX08J","Bordesley Green Girls' Sch & Sixth Form"]
[2030,"AX08H","Bordesley Green Primary School"]
[2238,"AX08N","Broadmeadow Infant School"]
[2236,"AX010","Broadmeadow Junior School"]
[4801,"AX08U","Cardinal Wiseman Catholic School"]
[2312,"AX015","Chad Vale Primary School"]
[7051,"AX017","Cherry Oak School"]
[2251,"AX08W","Chilcote Primary School"]
[3002,"AX01A","Christ Church CofE Primary Sch & Nursery"]
[3319,"AX019","Christ The King Catholic Primary School"]
[5416,"AX091","Colmers School and Sixth Form College"]
[2054,"AX092","Colmore Infant and Nursery School"]
[2053,"AX093","Colmore Junior School"]
[2296,"AX027","Glenmead Primary School"]
[2092,"AX02H","Hall Green Junior School"]
[4201,"AX0A1","Hodge Hill College"]
[4015,"AX0A2","Hodge Hill Girls' School"]
[4223,"AX0A4","Holte School"]
[2015,"AX032","James Watt Primary School"]
[2462,"AX03L","Little Sutton Primary School"]
[2127,"AX0AN","Lozells Junior & Infant School & Nursery"]
[2129,"AX03N","Lyndon Green Infant School"]
[2128,"AX03P","Lyndon Green Junior School"]
[2133,"AX03V","Marsh Hill Primary School"]
{"$rows_left_out":43}
{"sheet":"Notification","index":3,"n_rows":40,"n_cols":6,"rows_kept":40,"cut":false,"hidden":true,"merged":[]}
[null,null,null,null,null,{"$f":"+DFES!$E$1","v":1017}]
[]
[null,"2022/23 School Carry Forward and In Year Balance Notification"]
[]
[null,"School:",null,{"$f":"+DFES!$F$1","v":"Allens Croft Nursery School"}]
[null,"DFE No:",null,{"$f":"+DFES!$E$1","v":1017}]
[]
[]
[]
[]
[]
[]
[]
[]
[]
[]
[null,"School:",{"$f":"$D$5","v":"Allens Croft Nursery School"}]
[]
[null,"For the attention of the Headteacher"]
[]
[null,"Dear Sir or Madam"]
[]
[null,"Calculation of the School's In Year and Carried Forward Revenue Balances"]
[]
[null,"The Local Authority has closed the accounts of your school as at 31st March 2023 and"]
[null,"I confirm that the school's surplus / (deficit) revenue balances have been determined as follows:"]
[]
[null,"Brought Forward Revenue Surplus / (Deficit) Balance as at 1st April 2022"]
[]
[null,null,"£",{"$f":"-IF(ISNA(VLOOKUP(DFES!$E$1,'School Closing Balances 2022-23'!$E$3:$J$220,4,0)),0,VLOOKUP(DFES!$E$1,'School Closing Balances 2022-23'!$E$3:$J$220,4,0))","v":169669.19574638142}]
{"$rows_left_out":11}
{"sheet":"Total","index":4,"n_rows":236,"n_cols":11,"rows_kept":236,"cut":false,"hidden":true,"merged":[]}
["School/DSG Summary",null,null,null,null,null,825376.47211454809]
[null,null,null,null,null,null,{"$f":"SUM(G4:G229)","v":-74953710.540830165},{"$f":"SUM(H4:H229)","v":5083135.7511231815},{"$f":"SUM(I4:I229)","v":-69870574.78970699},{"$f":"SUM(J4:J229)","v":4511403.2499999953},{"$f":"SUM(K4:K229)","v":-571732.50112318574}]
["Area","Cost Centre","DFE Number","Cost Centre Name",null,"School Type","Opening Revenue Balance","In Year Position","Closing Balance 22/23","Oracle Balance","Variance"]
["DE600","AX001",1027,"               AX001-Adderley Nursery School","MNS","EPA",148341.2979798984,-145919.40000000008,{"$f":"SUM(G4:H4)","v":2421.89797989832},-145919.40000000008,{"$f":"J4-H4","v":0}]
["DE600","AX002",5949,"               AX002-Al-Furqan Primary School",null,"Non Chq Bk",-665695.99074752466,70048.590000001248,-595647.40074752341,70048.590000001248,0]
["DE600","AX004",2153,"               AX004-Allens Croft Primary School",null,"EPA",-860880.02028289856,663560.11999999871,-197319.90028289985,663560.11999999871,0]
["DE600","AX006",2062,"               AX006-Anderton Park Primary School",null,"Non Chq Bk",-615862.17428921571,331523.31000000052,-284338.86428921518,331523.31000000052,0]
["DE600","AX007",2479,"               AX007-Anglesey Primary School",null,"EPA",-606379.33572653984,-241205.11999999918,-847584.45572653902,-241205.11999999918,0]
["DE600","AX008",2300,"               AX008-Arden Primary School",null,"Non Chq Bk",-310748.60685842659,80386.230000000913,-230362.37685842568,80386.230000000913,0]
["DE600","AX00C",2014,"               AX00C-Barford Primary School",null,"Non Chq Bk",-567306.21111675899,468117.41999999946,-99188.79111675953,468117.41999999946,0]
["DE600","AX00E",7016,"               AX00E-Baskerville School",null,"Non Chq Bk",-795930.99259199179,-136054.01000000164,-931985.00259199343,-136054.01000000164,0]
["DE600","AX00F",7052,"               AX00F-Beaufort School",null,"Non Chq Bk",-379934.96057227149,239732.78000000073,-140202.18057227076,239732.78000000073,0]
["DE600","AX00G",2239,"               AX00G-Bellfield Infant School (NC)",null,"EPA",-262055.40131685766,123549.34000000008,-138506.06131685758,123549.34000000008,0]
["DE600","AX00H",2241,"               AX00H-Bellfield Junior School",null,"Non Chq Bk",-364166.91422474297,73118.610000000102,-291048.30422474287,73118.610000000102,0]
["DE600","AX00J",2456,"               AX00J-Bells Farm Primary School",null,"Non Chq Bk",-119499.08788878181,86736.409999999451,-32762.67788878236,86736.409999999451,0]
["DE600","AX00K",2435,"               AX00K-Benson Community School",null,"EPA",-587426.94549374538,130723.91000000155,-456703.03549374384,130723.91000000155,0]
["DE600","AX00L",2025,"               AX00L-Birches Green Infant School",null,"Academy",0,0,0,-69607.439999999828,-69607.439999999828]
["DE600","AX00Q",2254,"               AX00Q-Blakesley Hall Primary School",null,"Chq Bk",137954.61487297248,350258.16999999946,{"$f":"SUM(G18:H18)","v":488212.78487297194},350258.16999999946,0]
["DE600","AX00R",1025,"               AX00R-Bloomsbury Nursery School","MNS","Non Chq Bk",-186106.63154866314,43819.430000000517,-142287.20154866262,43819.430000000517,0]
["DE600","AX00T",2401,"               AX00T-Boldmere Junior School",null,"Chq Bk",-136008.63966666674,-34350.290000000008,{"$f":"SUM(G20:H20)","v":-170358.92966666675},-54712.430000000168,-20362.140000000159]
["DE600","AX00U",1001,"               AX00U-Bordesley Green East Nursery School","MNS","EPA",13592.322119036864,10695.689999999944,24288.012119036808,10695.689999999944,0]
["DE600","AX00X",3353,"               AX00X-Bournville Village Primary",null,"Non Chq Bk",-464990.36911598087,95311.85999999987,-369678.509115981,95311.85999999987,0]
["DE600","AX00Y",7030,"               AX00Y-Braidwood School for the Deaf",null,"EPA",-245775.77506760918,-148024.09999999963,-393799.87506760878,-148024.09999999963,0]
["DE600","AX00Z",1002,"               AX00Z-Brearley Nursery School","MNS","Non Chq Bk",-54611.885377906496,-758643.05000000016,-813254.93537790666,-758643.05000000016,0]
["DE600","AX010",2236,"               AX010-Broadmeadow Junior School",null,"Chq Bk",-291704.20632257918,70552.359999999986,{"$f":"SUM(G25:H25)","v":-221151.84632257919},70552.350000000093,-9.9999998928979039E-3]
["DE600","AX013",2465,"               AX013-Calshot Primary School",null,"EPA",-64328.774966962847,-39799.02000000095,-104127.79496696379,-39799.02000000095,0]
["DE600","AX014",1048,"               AX014-Castle Vale Nursery School","MNS","Non Chq Bk",-353386.54159248096,-2659.0599999999395,-356045.6015924809,-2659.0599999999395,0]
["DE600","AX015",2312,"               AX015-Chad Vale Primary School",null,"Chq Bk",0,-10718.990887551903,{"$f":"SUM(G28:H28)","v":-10718.990887551903},64622.609999998938,75341.600887550841]
["DE600","AX017",7051,"               AX017-Cherry Oak School",null,"Chq Bk",-469329,-52502.85,{"$f":"SUM(G29:H29)","v":-521831.85},-94467.810000000114,-41964.960000000116]
["DE600","AX018",2040,"               AX018-Cherry Orchard Primary School",null,"EPA",-112202.05401923822,118629.57000000076,6427.515980762546,118629.57000000076,0]
{"$rows_left_out":207}
{"sheet":"School Closing Balances 2022-23","index":5,"n_rows":222,"n_cols":17,"rows_kept":222,"cut":false,"hidden":true,"merged":[[0,7,0,9],[0,11,0,13],[0,14,0,16]]}
["Schools Closing Balances",null,"2022-23",null,null,null,"*Please note: Negatives are surpluses","Revenue",null,null,null,"DEVOLVED CAPITAL",null,null,"ENERGY EFFICIENCY GRANT"]
[null,null,null,null,null,null,null,"Opening","In-year","Published C/Fwd",null,"Opening","In-year","Closing","Opening","In-year","Closing"]
["Oracle Cost Centre","Type","SAP","LA No","DFE No","School Number","School Name","Balance","(Surplus)/Defict","after Adjustment",null,"Balance","(Surplus)/Defict","Balance","Balance","(Surplus)/Defict","Balance"]
["AX001",{"$f":"_xlfn.XLOOKUP(A4,[9]Sheet2!A:A,[9]Sheet2!D:D,0,FALSE)","v":"EPA"},"REAYW",330,1027,3301027,"ADDERLEY Nurs",148341.2979798984,-145919.40000000008,2421.89797989832,null,-5114.6999999999989,-4864,-9978.6999999999989,{"$f":"-_xlfn.XLOOKUP(A4,[10]Capital!B:B,[10]Capital!AG:AG,0,FALSE)","v":-11540.61},{"$f":"_xlfn.XLOOKUP(A4,[10]Capital!B:B,[10]Capital!AH:AH,0,FALSE)","v":0},{"$f":"O4+P4","v":-11540.61}]
["AX00U",{"$f":"_xlfn.XLOOKUP(A5,[9]Sheet2!A:A,[9]Sheet2!D:D,0,FALSE)","v":"EPA"},"REAYZ",330,1001,3301001,"BORDESLEY GREEN Nurs",13592.322119036864,10582.689999999944,24175.012119036808,null,-21804.730000000003,-4472.5,-26277.230000000003,{"$f":"-_xlfn.XLOOKUP(A5,[10]Capital!B:B,[10]Capital!AG:AG,0,FALSE)","v":-10842.52},{"$f":"_xlfn.XLOOKUP(A5,[10]Capital!B:B,[10]Capital!AH:AH,0,FALSE)","v":0},{"$f":"O5+P5","v":-10842.52}]
["AX01Q",{"$f":"_xlfn.XLOOKUP(A6,[9]Sheet2!A:A,[9]Sheet2!D:D,0,FALSE)","v":"EPA"},"REAYF",330,1802,3301802,"EDITH CADBURY Nrsy ",48973.267432412074,-5790.859999999986,43182.407432412088,null,-9212.4399999999987,-4560.25,-13772.689999999999,{"$f":"-_xlfn.XLOOKUP(A6,[10]Capital!B:B,[10]Capital!AG:AG,0,FALSE)","v":-10998.99},{"$f":"_xlfn.XLOOKUP(A6,[10]Capital!B:B,[10]Capital!AH:AH,0,FALSE)","v":0},-10998.99]
["AX07D",{"$f":"_xlfn.XLOOKUP(A7,[9]Sheet2!A:A,[9]Sheet2!D:D,0,FALSE)","v":"EPA"},"REAZW",330,1019,3301019,"WASHWOOD HEATH Nurs",349750.60395450948,34312.489999999991,384063.09395450947,null,-29669.64,-5080,-34749.64,{"$f":"-_xlfn.XLOOKUP(A7,[10]Capital!B:B,[10]Capital!AG:AG,0,FALSE)","v":-11925.76},{"$f":"_xlfn.XLOOKUP(A7,[10]Capital!B:B,[10]Capital!AH:AH,0,FALSE)","v":0},-11925.76]
["AX004",{"$f":"_xlfn.XLOOKUP(A8,[9]Sheet2!A:A,[9]Sheet2!D:D,0,FALSE)","v":"EPA"},"REAAH",330,2153,3302153,"ALLENS CROFT JI ",-860880.02028289856,663560.11999999871,-197319.90028289985,null,-12460.96,29702.75,17241.79,{"$f":"-_xlfn.XLOOKUP(A8,[10]Capital!B:B,[10]Capital!AG:AG,0,FALSE)","v":-17241.66},{"$f":"_xlfn.XLOOKUP(A8,[10]Capital!B:B,[10]Capital!AH:AH,0,FALSE)","v":0},-17241.66]
["AX007",{"$f":"_xlfn.XLOOKUP(A9,[9]Sheet2!A:A,[9]Sheet2!D:D,0,FALSE)","v":"EPA"},"REAAM",330,2479,3302479,"ANGLESEY JI NC",-606379.33572653984,-185311.45999999915,-791690.79572653899,null,-12241.75,9987.56,-2254.1900000000005,{"$f":"-_xlfn.XLOOKUP(A9,[10]Capital!B:B,[10]Capital!AG:AG,0,FALSE)","v":-24362.959999999999},{"$f":"_xlfn.XLOOKUP(A9,[10]Capital!B:B,[10]Capital!AH:AH,0,FALSE)","v":0},-24362.959999999999]
["AX00G",{"$f":"_xlfn.XLOOKUP(A10,[9]Sheet2!A:A,[9]Sheet2!D:D,0,FALSE)","v":"EPA"},"REAAY",330,2239,3302239,"BELLFIELD I NC",-262055.40131685766,123894.55000000008,-138160.85131685759,null,-10744.399999999994,1242.3099999999995,-9502.0899999999947,{"$f":"-_xlfn.XLOOKUP(A10,[10]Capital!B:B,[10]Capital!AG:AG,0,FALSE)","v":-13711.1},{"$f":"_xlfn.XLOOKUP(A10,[10]Capital!B:B,[10]Capital!AH:AH,0,FALSE)","v":0},-13711.1]
["AX00K",{"$f":"_xlfn.XLOOKUP(A11,[9]Sheet2!A:A,[9]Sheet2!D:D,0,FALSE)","v":"EPA"},"REABB",330,2435,3302435,"BENSON JI NC",-587426.94549374538,132123.91000000155,-455303.03549374384,null,-5685.6899999999878,-8798.1200000000008,-14483.809999999989,{"$f":"-_xlfn.XLOOKUP(A11,[10]Capital!B:B,[10]Capital!AG:AG,0,FALSE)","v":-18555.59},{"$f":"_xlfn.XLOOKUP(A11,[10]Capital!B:B,[10]Capital!AH:AH,0,FALSE)","v":0},-18555.59]
["AX013",{"$f":"_xlfn.XLOOKUP(A12,[9]Sheet2!A:A,[9]Sheet2!D:D,0,FALSE)","v":"EPA"},"REACB",330,2465,3302465,"CALSHOT JI NC",-64328.774966962847,-28093.150000000947,-92421.924966963794,null,-10528.830000000005,13722.96,3194.1299999999937,{"$f":"-_xlfn.XLOOKUP(A12,[10]Capital!B:B,[10]Capital!AG:AG,0,FALSE)","v":-18786.28},{"$f":"_xlfn.XLOOKUP(A12,[10]Capital!B:B,[10]Capital!AH:AH,0,FALSE)","v":0},-18786.28]
["AX018",{"$f":"_xlfn.XLOOKUP(A13,[9]Sheet2!A:A,[9]Sheet2!D:D,0,FALSE)","v":"EPA"},"REACF",330,2040,3302040,"CHERRY ORCHARD JI NC",-112202.05401923822,118629.57000000076,6427.515980762546,null,0,-7060.0599999999977,-7060.0599999999977,{"$f":"-_xlfn.XLOOKUP(A13,[10]Capital!B:B,[10]Capital!AG:AG,0,FALSE)","v":-19203.53},{"$f":"_xlfn.XLOOKUP(A13,[10]Capital!B:B,[10]Capital!AH:AH,0,FALSE)","v":0},-19203.53]
["AX01B",{"$f":"_xlfn.XLOOKUP(A14,[9]Sheet2!A:A,[9]Sheet2!D:D,0,FALSE)","v":"EPA"},"REACN",330,3432,3303432,"CLIFTON JI NC",-654009.86535320012,317278.11999999918,-336731.74535320094,null,-1364.4299999999894,-9820.25,-11184.679999999989,{"$f":"-_xlfn.XLOOKUP(A14,[10]Capital!B:B,[10]Capital!AG:AG,0,FALSE)","v":-26886.51},{"$f":"_xlfn.XLOOKUP(A14,[10]Capital!B:B,[10]Capital!AH:AH,0,FALSE)","v":0},-26886.51]
["AX01E",{"$f":"_xlfn.XLOOKUP(A15,[9]Sheet2!A:A,[9]Sheet2!D:D,0,FALSE)","v":"EPA"},"REACQ",330,2185,3302185,"COLEBOURNE JI ",-233913.24908272631,10249.52000000095,-223663.72908272536,null,-9116.489999999998,-9087.25,-18203.739999999998,{"$f":"-_xlfn.XLOOKUP(A15,[10]Capital!B:B,[10]Capital!AG:AG,0,FALSE)","v":-19071.13},{"$f":"_xlfn.XLOOKUP(A15,[10]Capital!B:B,[10]Capital!AH:AH,0,FALSE)","v":0},-19071.13]
["AX01G",{"$f":"_xlfn.XLOOKUP(A16,[9]Sheet2!A:A,[9]Sheet2!D:D,0,FALSE)","v":"EPA"},"REACY",330,2464,3302464,"COPPICE JI ",-91418.274286986591,332044.66999999993,240626.39571301333,null,-3275.2099999999991,2915.75,-359.45999999999913,{"$f":"-_xlfn.XLOOKUP(A16,[10]Capital!B:B,[10]Capital!AG:AG,0,FALSE)","v":-18445.259999999998},{"$f":"_xlfn.XLOOKUP(A16,[10]Capital!B:B,[10]Capital!AH:AH,0,FALSE)","v":0},-18445.259999999998]
["AX01R",{"$f":"_xlfn.XLOOKUP(A17,[9]Sheet2!A:A,[9]Sheet2!D:D,0,FALSE)","v":"EPA"},"READJ",330,2454,3302454,"ELMS FARM JI NC",-356218.38659480005,-90989.540000000503,-447207.92659480055,null,-11307.289999999999,1380.3799999999992,-9926.91,{"$f":"-_xlfn.XLOOKUP(A17,[10]Capital!B:B,[10]Capital!AG:AG,0,FALSE)","v":-17049.080000000002},{"$f":"_xlfn.XLOOKUP(A17,[10]Capital!B:B,[10]Capital!AH:AH,0,FALSE)","v":0},-17049.080000000002]
["AX01T",{"$f":"_xlfn.XLOOKUP(A18,[9]Sheet2!A:A,[9]Sheet2!D:D,0,FALSE)","v":"EPA"},"READK",330,3321,3303321,"ENGLISH MARTYRS RC JI ",-344067.62957499252,141066.84999999916,-203000.77957499336,null,0,0,0,{"$f":"-_xlfn.XLOOKUP(A18,[10]Capital!B:B,[10]Capital!AG:AG,0,FALSE)","v":0},{"$f":"_xlfn.XLOOKUP(A18,[10]Capital!B:B,[10]Capital!AH:AH,0,FALSE)","v":0},0]
["AX020",{"$f":"_xlfn.XLOOKUP(A19,[9]Sheet2!A:A,[9]Sheet2!D:D,0,FALSE)","v":"EPA"},"READX",330,3435,3303435,"FOUR OAKS JI ",-198865.28561240673,23160.799999999348,-175704.48561240738,null,-25504.80999999999,4495.2999999999993,-21009.509999999991,{"$f":"-_xlfn.XLOOKUP(A19,[10]Capital!B:B,[10]Capital!AG:AG,0,FALSE)","v":-18445.259999999998},{"$f":"_xlfn.XLOOKUP(A19,[10]Capital!B:B,[10]Capital!AH:AH,0,FALSE)","v":0},-18445.259999999998]
["AX026",{"$f":"_xlfn.XLOOKUP(A20,[9]Sheet2!A:A,[9]Sheet2!D:D,0,FALSE)","v":"EPA"},"REAEA",330,2081,3302081,"GILBERTSTONE JI NC",-143141.85573965835,78126.899999999616,-65014.955739658741,null,-16871.449999999993,-8587.75,-25459.199999999993,{"$f":"-_xlfn.XLOOKUP(A20,[10]Capital!B:B,[10]Capital!AG:AG,0,FALSE)","v":-18180.47},{"$f":"_xlfn.XLOOKUP(A20,[10]Capital!B:B,[10]Capital!AH:AH,0,FALSE)","v":0},-18180.47]
["AX02G",{"$f":"_xlfn.XLOOKUP(A21,[9]Sheet2!A:A,[9]Sheet2!D:D,0,FALSE)","v":"EPA"},"REAEN",330,2093,3302093,"HALL GREEN I NC",-271201.66842712724,-6037.5100000005914,-277239.17842712783,null,-36475.08,-8356,-44831.08,{"$f":"-_xlfn.XLOOKUP(A21,[10]Capital!B:B,[10]Capital!AG:AG,0,FALSE)","v":-17767.23},{"$f":"_xlfn.XLOOKUP(A21,[10]Capital!B:B,[10]Capital!AH:AH,0,FALSE)","v":0},-17767.23]
["AX02M",{"$f":"_xlfn.XLOOKUP(A22,[9]Sheet2!A:A,[9]Sheet2!D:D,0,FALSE)","v":"EPA"},"REAEW",330,2099,3302099,"HAWTHORN JI ",-276063.65140764031,36895.790000000212,-239167.8614076401,null,-9548.630000000001,5125.5,-4423.130000000001,{"$f":"-_xlfn.XLOOKUP(A22,[10]Capital!B:B,[10]Capital!AG:AG,0,FALSE)","v":-14501.46},{"$f":"_xlfn.XLOOKUP(A22,[10]Capital!B:B,[10]Capital!AH:AH,0,FALSE)","v":0},-14501.46]
["AX03E",{"$f":"_xlfn.XLOOKUP(A23,[9]Sheet2!A:A,[9]Sheet2!D:D,0,FALSE)","v":"EPA"},"REAGE",330,2189,3302189,"LADYPOOL JI NC",-96107.14656045787,-39896.980000000229,-136004.1265604581,null,-13325,-7892.5,-21217.5,{"$f":"-_xlfn.XLOOKUP(A23,[10]Capital!B:B,[10]Capital!AG:AG,0,FALSE)","v":-16940.759999999998},{"$f":"_xlfn.XLOOKUP(A23,[10]Capital!B:B,[10]Capital!AH:AH,0,FALSE)","v":0},-16940.759999999998]
["AX03F",{"$f":"_xlfn.XLOOKUP(A24,[9]Sheet2!A:A,[9]Sheet2!D:D,0,FALSE)","v":"EPA"},"REAGF",330,2119,3302119,"LAKEY LANE JI NC",-4139.5339788249548,91181.010000000824,87041.476021175869,null,-12268.900000000003,11757.939999999999,-510.96000000000458,{"$f":"-_xlfn.XLOOKUP(A24,[10]Capital!B:B,[10]Capital!AG:AG,0,FALSE)","v":-18726.099999999999},{"$f":"_xlfn.XLOOKUP(A24,[10]Capital!B:B,[10]Capital!AH:AH,0,FALSE)","v":0},-18726.099999999999]
["AX03Q",{"$f":"_xlfn.XLOOKUP(A25,[9]Sheet2!A:A,[9]Sheet2!D:D,0,FALSE)","v":"EPA"},"REAGP",330,2420,3302420,"MANEY HILL JI ",-406384.29988325853,98924.240000000224,-307460.05988325831,null,-29336.819999999996,-5656.25,-34993.069999999992,{"$f":"-_xlfn.XLOOKUP(A25,[10]Capital!B:B,[10]Capital!AG:AG,0,FALSE)","v":-17843.46},{"$f":"_xlfn.XLOOKUP(A25,[10]Capital!B:B,[10]Capital!AH:AH,0,FALSE)","v":0},-17843.46]
["AX040",{"$f":"_xlfn.XLOOKUP(A26,[9]Sheet2!A:A,[9]Sheet2!D:D,0,FALSE)","v":"EPA"},"REAHC",330,2406,3302406,"MINWORTH JI ",-210915.62274005645,-69380.700000000448,-280296.3227400569,null,-47270.35,-27077.06,-74347.41,{"$f":"-_xlfn.XLOOKUP(A26,[10]Capital!B:B,[10]Capital!AG:AG,0,FALSE)","v":-14152.42},{"$f":"_xlfn.XLOOKUP(A26,[10]Capital!B:B,[10]Capital!AH:AH,0,FALSE)","v":0},-14152.42]
["AX04A",{"$f":"_xlfn.XLOOKUP(A27,[9]Sheet2!A:A,[9]Sheet2!D:D,0,FALSE)","v":"EPA"},"REAHY",330,2436,3302436,"OSBORNE JI ",0,0,0,null,-9592.4300000000021,0,-9592.4300000000021,{"$f":"-_xlfn.XLOOKUP(A27,[10]Capital!B:B,[10]Capital!AG:AG,0,FALSE)","v":0},{"$f":"_xlfn.XLOOKUP(A27,[10]Capital!B:B,[10]Capital!AH:AH,0,FALSE)","v":0},0]
["AX04D",{"$f":"_xlfn.XLOOKUP(A28,[9]Sheet2!A:A,[9]Sheet2!D:D,0,FALSE)","v":"EPA"},"REAHZ",330,3351,3303351,"OUR LADY AND ST ROSE RC JI NC",-167375.58724562451,-7794.5600000002887,-175170.1472456248,null,0,0,0,{"$f":"-_xlfn.XLOOKUP(A28,[10]Capital!B:B,[10]Capital!AG:AG,0,FALSE)","v":0},{"$f":"_xlfn.XLOOKUP(A28,[10]Capital!B:B,[10]Capital!AH:AH,0,FALSE)","v":0},0]
["AX04E",{"$f":"_xlfn.XLOOKUP(A29,[9]Sheet2!A:A,[9]Sheet2!D:D,0,FALSE)","v":"EPA"},"REAJB",330,3328,3303328,"OUR LADY OF LOURDES RC JI NC",-233425.31743972193,-68914.859999999782,-302340.17743972171,null,0,-109.72,-109.72,{"$f":"-_xlfn.XLOOKUP(A29,[10]Capital!B:B,[10]Capital!AG:AG,0,FALSE)","v":0},{"$f":"_xlfn.XLOOKUP(A29,[10]Capital!B:B,[10]Capital!AH:AH,0,FALSE)","v":0},0]
["AX04G",{"$f":"_xlfn.XLOOKUP(A30,[9]Sheet2!A:A,[9]Sheet2!D:D,0,FALSE)","v":"EPA"},"REAJE",330,2021,3302021,"PAGANEL JI NC",-390955.51163991273,25503.740000000689,-365451.77163991204,null,-34544.180000000008,4052.12,-30492.060000000009,{"$f":"-_xlfn.XLOOKUP(A30,[10]Capital!B:B,[10]Capital!AG:AG,0,FALSE)","v":-17203.55},{"$f":"_xlfn.XLOOKUP(A30,[10]Capital!B:B,[10]Capital!AH:AH,0,FALSE)","v":0},-17203.55]
{"$rows_left_out":192}