{"text_format":"1","workbook":"xlsx","n_sheets":7,"sheets":["Menu","School List","DFES","Schedule","DATA","Contact List","Timetable"],"not_rendered":{"charts":0,"images":3,"macros":1,"external_links":0,"defined_names":8,"comments":1,"pivot_tables":0},"unopened":[],"bounds":{"document_bytes":16777216,"sheet_cells":100000,"rows_first":2000,"rows_last":500,"rows_between":2000,"halvings":0,"cell_chars":16384,"cell_head_chars":4096},"cells_cut":0,"cells_raw":0,"read":"whole","date_system":"1900"}

{"sheet":"Menu","index":0,"n_rows":159,"n_cols":13,"rows_kept":159,"cut":false,"hidden":false,"merged":[]}
[null,null,null,{"$f":"IF(ISNA(VLOOKUP(E1,A100:$B$500,2,0)),0,VLOOKUP(E1,A100:$B$500,2,0))","v":4173},{"$f":"+DFES!E1","v":4173}]
[]
[]
[]
[]
[]
[]
[]
[]
[null,"2023/24 Cheque Book School Instalment Payments"]
[null,"Please Left Click on the Macro Button below to continue."]
[null,"If the aforementioned does not function, please refer to the Macro Guidance from this link:",null,null,null,null,null,null,null,null,null,null,"Macro guidance"]
[null,"Should the Protected View message be visible on the Toolbar, click on Enable Editing."]
[]
[]
[]
[]
[]
[]
[]
{"$rows_left_out":140}
{"sheet":"School List","index":1,"n_rows":65,"n_cols":79,"rows_kept":65,"cut":false,"hidden":true,"merged":[[0,3,6,3],[0,4,4,4]]}
[null,null,null,null,null,null,null,null,null,null,null,null,null,null,null,null,null,null,null,null,null,null,null,null,null,null,null,null,null,null,null,null,null,null,null,null,null,null,null,null,null,null,null,null,null,null,null,null,null,null,null,null,null,null,null,null,null,null,null,null,null,null,null,null,null,null,null,null,null,null,null,null,null,null,null,null,null,null,"ok"]
[]
[]
["DFE"]
["Number",null,"Name"]
[2010,null,"Adderley Primary School"]
[1017,null,"Allens Croft Childrens Centre"]
[2300,null,"Arden Primary"]
[7016,null,"Baskerville School"]
[5413,null,"Bishop Challoner Catholic College"]
[2402,null,"Boldmere Infant & Nursery School"]
[2401,null,"Boldmere Junior School"]
[4115,null,"Bordesley Green Girls School"]
[2030,null,"Bordesley Green Primary School"]
[2238,null,"Broadmeadow Infant & Nursery School"]
[2236,null,"Broadmeadow Junior School"]
[4801,null,"Cardinal Wiseman Catholic Technology College"]
[2312,null,"Chad Vale Primary School"]
[7051,null,"Cherry Oak School"]
[2251,null,"Chilcote Primary School"]
{"$rows_left_out":46}
{"sheet":"DFES","index":2,"n_rows":72,"n_cols":29,"rows_kept":72,"cut":false,"hidden":true,"merged":[]}
[2010,"AX085","Adderley Primary School",null,4173,{"$f":"IF(ISNA(VLOOKUP($E$1,$A$1:$C$72,3,0)),0,VLOOKUP($E$1,$A$1:$C$72,3,0))","v":"Queensbridge School"},null,null,null,null,null,null,null,null,null,null,null,null,null,null,null,null,null,null,null,"2011/12","2010/11","January 2011 CENSUS","January 2010 CENSUS"]
[1017,"AX087","Allens Croft Childrens Centre"]
[2300,"AX008","Arden Primary"]
[7016,"AX00E","Baskerville School"]
[5413,"AX08C","Bishop Challoner Catholic College"]
[2402,"AX08G","Boldmere Infant & Nursery School"]
[2401,"AX00T","Boldmere Junior School"]
[4115,"AX08J","Bordesley Green Girls School"]
[2030,"AX08H","Bordesley Green Primary School"]
[2238,"AX08N","Broadmeadow Infant & Nursery School"]
[2236,"AX010","Broadmeadow Junior School"]
[4801,"AX08U","Cardinal Wiseman Catholic Technology College"]
[2312,"AX015","Chad Vale Primary School"]
[7051,"AX017","Cherry Oak School"]
[2251,"AX08W","Chilcote Primary School"]
[3002,"AX01A","Christ Church CE Primary School"]
[3319,"AX019","Christ The King Catholic Primary School"]
[5416,"AX091","Colmers School and Sixth Form College"]
[2054,"AX092","Colmore Infant School"]
[2053,"AX093","Colmore Junior School"]
{"$rows_left_out":53}
{"sheet":"Schedule","index":3,"n_rows":48,"n_cols":12,"rows_kept":48,"cut":false,"hidden":true,"merged":[[12,1,12,9],[33,1,33,4],[34,1,34,4],[35,1,35,4],[36,1,36,4],[31,5,31,7],[13,1,13,9],[14,1,14,9],[15,1,15,9],[17,1,17,9],[44,1,44,4],[18,1,18,9],[42,1,42,4],[16,1,16,9],[45,1,45,4],[37,1,37,4],[39,1,39,4],[40,1,40,4],[41,1,41,4],[38,1,38,4],[43,1,43,4]]}
[null,null,null,null,null,{"$f":"+DFES!$E$1","v":4173}]
[]
[null,"2023/24 Cheque Book School Instalment Payments"]
[]
[null,"School:",null,{"$f":"+DFES!$F$1","v":"Queensbridge School"}]
[null,"DFE No:",null,{"$f":"+DFES!$E$1","v":4173}]
[]
[]
[null,"Section 251 Budget 2023/24",null,null,null,null,null,null,null,null,"£","£"]
[]
[null,"Total SBS (From APT 23/24)",null,null,null,null,null,null,null,null,null,{"$f":"IF(ISNA(VLOOKUP(DFES!$E$1,DATA!$A$1:$CK$299,7,0)),0,VLOOKUP(DFES!$E$1,DATA!$A$1:$CK$299,7,0))","v":6107141.7441145414}]
[]
[null,"High Needs Place Funding",null,null,null,null,null,null,null,null,null,{"$f":"IF(ISNA(VLOOKUP(DFES!$E$1,DATA!$A$1:$CK$299,8,0)),0,VLOOKUP(DFES!$E$1,DATA!$A$1:$CK$299,8,0))","v":0}]
[null,"High Needs Resource Base Funding",null,null,null,null,null,null,null,null,null,{"$f":"IF(ISNA(VLOOKUP(DFES!$E$1,DATA!$A$1:$CK$299,9,0)),0,VLOOKUP(DFES!$E$1,DATA!$A$1:$CK$299,9,0))","v":0}]
[null,"Teachers Pay / Pension",null,null,null,null,null,null,null,null,null,{"$f":"IF(ISNA(VLOOKUP(DFES!$E$1,DATA!$A$1:$CK$299,10,0)),0,VLOOKUP(DFES!$E$1,DATA!$A$1:$CK$299,10,0))","v":0}]
[null,"Early Years Funding",null,null,null,null,null,null,null,null,null,{"$f":"IF(ISNA(VLOOKUP(DFES!$E$1,DATA!$A$1:$CK$299,11,0)),0,VLOOKUP(DFES!$E$1,DATA!$A$1:$CK$299,11,0))","v":0}]
[null,"Post 16 Funding Apr - Jul",null,null,null,null,null,null,null,null,null,{"$f":"IF(ISNA(VLOOKUP(DFES!$E$1,DATA!$A$1:$CK$299,12,0)),0,VLOOKUP(DFES!$E$1,DATA!$A$1:$CK$299,12,0))","v":0}]
[null,"Post 16 Funding Aug - Mar",null,null,null,null,null,null,null,null,null,{"$f":"IF(ISNA(VLOOKUP(DFES!$E$1,DATA!$A$1:$CK$299,13,0)),0,VLOOKUP(DFES!$E$1,DATA!$A$1:$CK$299,13,0))","v":0}]
[null,"Devolved Top Up (Special Only)",null,null,null,null,null,null,null,null,null,{"$f":"IF(ISNA(VLOOKUP(DFES!$E$1,DATA!$A$1:$CK$299,14,0)),0,VLOOKUP(DFES!$E$1,DATA!$A$1:$CK$299,14,0))","v":0}]
[]
{"$rows_left_out":29}
{"sheet":"DATA","index":4,"n_rows":94,"n_cols":79,"rows_kept":94,"cut":false,"hidden":true,"merged":[]}
[]
[]
["2023/24 FULL CHEQUE BOOK SCHOOLS EQUAL INSTALMENTS",null,null,null,null,null,null,"Addition","Addition","Addition","Addition","Addition","Addition","Addition","Deduction","Addition/Deduction before Top Slice 0.0132%","Deduction","After all deductions"]
[1,2,3,4,5,6,7,8,9,10,11,12,13,14,15,16,17,18,19,20,21,22,23,24,25,26,27,28,29,30,31,32,33,34,35,36,37,38,39,40,41,42,43,44,45,46,47,48,49,50,51,52,53,54,55,56,57,58,59,60,61,62,63,64,65,66,67,68,69,70,71,72,73,74,75,76,77,78,79]
["DFE Num","Oracle","Fund Centre","School","Vendor Number","Statistical Order","Total SBS from APT 23-24","High Needs Place Funding","High Needs Resource Base Funding","Teachers Pay / Pension","Early Years Funding","Post 16 Funding Apr - Jul","Post 16 Funding Aug - Mar","Devolved Top Up (Special Only)","Insurance Deductions ","Revised SBS (G+H+I+J+K+L+M+N)","Top Slice 0.0132%","Revised SBS Less Top Slice (L-M) To Pay per Annum",null,null,"Duplicated Supplementary Grant",null,"April Instalment","April Adjustment ","Actual April Payment ",null,"May Instalment ","May Adjustment","Actual May Payment ",null,"June Instalment","June Adjustment","Actual June Payment",null,"July Instalment ","July Adjustment","Actual July Payment",null,"August Instalment","August Adjustment","Actual August Payment",null,"September Instalment","September Adjustment- ","Actual September Payment",null,"October Instalment","October Adjustment","Actual October Payment",null,"November Instalment","November Adjustment","Actual November Payment",null,"December Instalment","December Adjustment","Actual December Payment",null,"January Instalment ","January Adjustment","Actual January Payment ",null,"February Instalment","February Adjustment","Actual February Payment",null,"March Instalment","March Adjustment","Actual March Payment",null,"Total Instalments","Total Adjustments","Total Actual Payments Made To Sch","Check ","Comments","Check:"]
[2010,"AX085",null,"Adderley Primary School",null,null,2415887.0251943506,null,0,null,0,null,null,null,-10880,2405007.0251943506,-317.46092732565432,2404689.5642670249,null,null,-43422,null,null,null,156968.79702225208,null,null,null,200390.79702225208,null,null,null,200390.79702225208,null,null,null,200390.79702225208,null,null,null,200390.79702225208,null,null,null,200390.79702225208,null,null,null,200390.79702225208,null,null,null,200390.79702225208,null,null,null,200390.79702225208,null,null,null,200390.79702225208,null,null,null,200390.79702225208,null,null,null,200390.79702225208,null,2404689.5642670249]
[1017,"AX087",null,"Allens Croft Childrens Centre",null,null,0,null,36000,null,848428.99416034075,null,null,null,-2850,881578.99416034075,-116.36842722916499,881462.62573311164,null,null,-2079,null,null,null,71376.218811092636,null,null,null,73455.218811092636,null,null,null,73455.218811092636,null,null,null,73455.218811092636,null,null,null,73455.218811092636,null,null,null,73455.218811092636,null,null,null,73455.218811092636,null,null,null,73455.218811092636,null,null,null,73455.218811092636,null,null,null,73455.218811092636,null,null,null,73455.218811092636,null,null,null,73455.218811092636,null,881462.62573311187]
[5413,"AX08C",null,"Bishop Challoner Catholic College",null,null,6257798.0371762626,null,0,null,0,446121.33333333331,892242.66666666663,null,0,7596162.0371762626,-1002.6933889072667,7595159.3437873553,null,null,-112836,null,null,null,520093.94531561295,null,null,null,632929.94531561295,null,null,null,632929.94531561295,null,null,null,632929.94531561295,null,null,null,632929.94531561295,null,null,null,632929.94531561295,null,null,null,632929.94531561295,null,null,null,632929.94531561295,null,null,null,632929.94531561295,null,null,null,632929.94531561295,null,null,null,632929.94531561295,null,null,null,632929.94531561295,null,7595159.3437873535]
[2254,"AX00Q",null,"Blakesley Hall Primary School",null,null,2905035.2195624933,null,0,null,0,null,null,null,-16230,2888805.2195624933,-381.32228898224912,2888423.8972735112,null,null,-48210,null,null,null,0,null,null,null,240701.99143945926,null,null,null,240701.99143945926,null,null,null,240701.99143945926,null,null,null,240701.99143945926,null,null,null,240701.99143945926,null,null,null,240701.99143945926,null,null,null,240701.99143945926,null,null,null,240701.99143945926,null,null,null,240701.99143945926,null,null,null,240701.99143945926,null,null,null,240701.99143945926,null,2695931.9058340527]
[2402,"AX08G",null,"Boldmere Infant & Nursery School",null,null,1251450.001292224,null,136000,null,119862.02884615386,null,null,null,-4450,1502862.0301383778,-198.37778797826587,1502663.6523503996,null,null,-20231,null,null,null,104990.97102919997,null,null,null,125221.97102919997,null,null,null,125221.97102919997,null,null,null,125221.97102919997,null,null,null,125221.97102919997,null,null,null,125221.97102919997,null,null,null,125221.97102919997,null,null,null,125221.97102919997,null,null,null,125221.97102919997,null,null,null,125221.97102919997,null,null,null,125221.97102919997,null,null,null,125221.97102919997,null,1502663.6523503994]
[2401,"AX00T",null,"Boldmere Junior School",null,null,1664650.8,null,0,null,0,null,null,null,-8200,1656450.8,-218.65150560000004,1656232.1484944001,null,null,-25833,null,null,null,112186.34570786668,null,null,null,138019.34570786668,null,null,null,138019.34570786668,null,null,null,138019.34570786668,null,null,null,138019.34570786668,null,null,null,138019.34570786668,null,null,null,138019.34570786668,null,null,null,138019.34570786668,null,null,null,138019.34570786668,null,null,null,138019.34570786668,null,null,null,138019.34570786668,null,null,null,138019.34570786668,null,1656232.1484943999]
[4115,"AX08J",null,"Bordesley Green Girls School",null,null,4682933.784230493,null,76000,null,0,707197.66666666663,1414395.3333333333,null,-16230,6864296.784230493,-906.08717551842517,6863390.6970549747,null,null,-85474,null,null,null,486475.22475458123,null,null,null,571949.22475458123,null,null,null,571949.22475458123,null,null,null,571949.22475458123,null,null,null,571949.22475458123,null,null,null,571949.22475458123,null,null,null,571949.22475458123,null,null,null,571949.22475458123,null,null,null,571949.22475458123,null,null,null,571949.22475458123,null,null,null,571949.22475458123,null,null,null,571949.22475458123,null,6863390.6970549747]
[2030,"AX08H",null,"Bordesley Green Primary School",null,null,3215725.6028137458,null,0,null,139816.65882352943,null,null,null,-16230,3339312.2616372751,-440.78921853612036,3338871.472418739,null,null,-50630,null,null,null,227609.28936822823,null,null,null,278239.28936822823,null,null,null,278239.28936822823,null,null,null,278239.28936822823,null,null,null,278239.28936822823,null,null,null,278239.28936822823,null,null,null,278239.28936822823,null,null,null,278239.28936822823,null,null,null,278239.28936822823,null,null,null,278239.28936822823,null,null,null,278239.28936822823,null,null,null,278239.28936822823,null,3338871.4724187381]
[2238,"AX08N",null,"Broadmeadow Infant & Nursery School",null,null,886003.20884459652,null,0,null,110949.25,null,null,null,-4450,992502.45884459652,-131.01032456748675,992371.44852002908,null,null,-15334,null,null,null,67363.620710002418,null,null,null,82697.620710002418,null,null,null,82697.620710002418,null,null,null,82697.620710002418,null,null,null,82697.620710002418,null,null,null,82697.620710002418,null,null,null,82697.620710002418,null,null,null,82697.620710002418,null,null,null,82697.620710002418,null,null,null,82697.620710002418,null,null,null,82697.620710002418,null,null,null,82697.620710002418,null,992371.44852002885]
[2236,"AX010",null,"Broadmeadow Junior School",null,null,1182182.6515714286,null,0,null,0,null,null,null,-4450,1177732.6515714286,-155.46071000742859,1177577.1908614212,null,null,-21020,null,null,null,77111.432571785102,null,null,null,98131.432571785102,null,null,null,98131.432571785102,null,null,null,98131.432571785102,null,null,null,98131.432571785102,null,null,null,98131.432571785102,null,null,null,98131.432571785102,null,null,null,98131.432571785102,null,null,null,98131.432571785102,null,null,null,98131.432571785102,null,null,null,98131.432571785102,null,null,null,98131.432571785102,null,1177577.1908614209]
[4801,"AX08U",null,"Cardinal Wiseman Catholic Technology College",null,null,5416565.2146107918,null,0,null,0,null,null,null,-16230,5400335.2146107918,-712.84424832862453,5399622.3703624634,null,null,-91449,null,null,null,358519.53086353862,null,null,null,449968.53086353862,null,null,null,449968.53086353862,null,null,null,449968.53086353862,null,null,null,449968.53086353862,null,null,null,449968.53086353862,null,null,null,449968.53086353862,null,null,null,449968.53086353862,null,null,null,449968.53086353862,null,null,null,449968.53086353862,null,null,null,449968.53086353862,null,null,null,449968.53086353862,null,5399622.3703624615]
[2312,"AX015",null,"Chad Vale Primary School",null,null,1915891.3970385001,null,0,null,0,null,null,null,-8200,1907691.3970385001,-251.81526440908203,1907439.5817740909,null,null,-28935,null,null,null,130018.29848117425,null,null,null,158953.29848117425,null,null,null,158953.29848117425,null,null,null,158953.29848117425,null,null,null,158953.29848117425,null,null,null,158953.29848117425,null,null,null,158953.29848117425,null,null,null,158953.29848117425,null,null,null,158953.29848117425,null,null,null,158953.29848117425,null,null,null,158953.29848117425,null,null,null,158953.29848117425,null,1907439.5817740911]
[7051,"AX017",null,"Cherry Oak School",null,null,0,1110000,0,84360,1833,null,null,1120607,-2850,2313950,-305.44140000000004,2313644.5586000001,null,null,0,null,null,null,192803.71321666669,null,null,null,192803.71321666669,null,null,null,192803.71321666669,null,null,null,192803.71321666669,null,null,null,192803.71321666669,null,null,null,192803.71321666669,null,null,null,192803.71321666669,null,null,null,192803.71321666669,null,null,null,192803.71321666669,null,null,null,192803.71321666669,null,null,null,192803.71321666669,null,null,null,192803.71321666669,null,2313644.5585999996]
[2251,"AX08W",null,"Chilcote Primary School",null,null,1840758.793510668,null,0,null,111614.2,null,null,null,-8200,1944172.9935106679,-256.63083514340821,1943916.3626755245,null,null,-29863,null,null,null,132130.03022296037,null,null,null,161993.03022296037,null,null,null,161993.03022296037,null,null,null,161993.03022296037,null,null,null,161993.03022296037,null,null,null,161993.03022296037,null,null,null,161993.03022296037,null,null,null,161993.03022296037,null,null,null,161993.03022296037,null,null,null,161993.03022296037,null,null,null,161993.03022296037,null,null,null,161993.03022296037,null,1943916.3626755241]
[3002,"AX01A",null,"Christ Church CE Primary School",null,null,1209196.9850579042,null,0,null,73644.178461538453,null,null,null,-4450,1278391.1635194425,-168.74763358456642,1278222.415885858,null,null,-18736,null,null,null,87782.534657154829,null,null,null,106518.53465715483,null,null,null,106518.53465715483,null,null,null,106518.53465715483,null,null,null,106518.53465715483,null,null,null,106518.53465715483,null,null,null,106518.53465715483,null,null,null,106518.53465715483,null,null,null,106518.53465715483,null,null,null,106518.53465715483,null,null,null,106518.53465715483,null,null,null,106518.53465715483,null,1278222.415885858]
{"$rows_left_out":75}
{"sheet":"Contact List","index":5,"n_rows":63,"n_cols":5,"rows_kept":63,"cut":false,"hidden":true,"merged":[]}
["FULL CHEQUE BOOK SCHOOLS WEF 01/04/2023"]
[]
["DFE Num","Oracle Code","School @Apr2023","Vendor Number","Contact Name"]
[2010,"AX085","Adderley Primary School",null,"Vijay Patel"]
[1017,"AX087","Allens Croft Childrens Centre",null,"Linda Sewell"]
[2300,"AX008","Arden Primary",null,"Cameron Birkett"]
[7016,"AX00E","Baskerville School",null,"Simone Ward"]
[5413,"AX08C","Bishop Challoner Catholic College",null,"Vijay Patel"]
[2402,"AX08G","Boldmere Infant & Nursery School",null,"Michelle Rudd  "]
[2401,"AX00T","Boldmere Junior School",null,"Vijay Patel"]
[4115,"AX08J","Bordesley Green Girls School",null,"Linda Sewell"]
[2030,"AX08H","Bordesley Green Primary School",null,"Linda Sewell"]
[2238,"AX08N","Broadmeadow Infant & Nursery School",null,"Linda Sewell"]
[2236,"AX010","Broadmeadow Junior School",null,"Cameron Birkett"]
[4801,"AX08U","Cardinal Wiseman Catholic Technology College",null,"Linda Sewell"]
[2312,"AX015","Chad Vale Primary School",null,"Michelle Rudd  "]
[7051,"AX017","Cherry Oak School",null,"Cameron Birkett"]
[2251,"AX08W","Chilcote Primary School",null,"Michelle Rudd  "]
[3002,"AX01A","Christ Church CE Primary School",null,"Linda Sewell"]
[3319,"AX019","Christ The King Catholic Primary School",null,"Vijay Patel"]
{"$rows_left_out":44}
{"sheet":"Timetable","index":6,"n_rows":21,"n_cols":7,"rows_kept":21,"cut":false,"hidden":true,"merged":[[0,1,0,6]]}
[null,"Cheque Book Schools -2023/24 Timetable for Submission of  Financial Returns to Birmingham City Council"]
[]
["Return Required","Period Start","Period End","Report to be Produced On","Reports to reach BCC By","Payment Processed By BCC","Payment Received By School"]
["April VAT return","2023-04-01","2023-04-30","2023-05-03","2023-05-10","2023-05-20","2023-05-27"]
["May VAT return","2023-05-01","2023-05-31","2023-06-01","2023-06-08","2023-06-19","2023-06-26"]
["June VAT return","2023-06-01","2023-06-30","2023-07-03","2023-07-10","2023-07-20","2023-07-27"]
["July/August VAT return","2023-07-01","2023-08-31","2023-09-04","2023-09-11","2023-09-21","2023-09-28"]
["September VAT return","2023-09-01","2023-09-30","2023-10-03","2023-10-10","2023-10-20","2023-10-27"]
["October VAT return","2023-10-01","2023-10-31","2023-11-01","2023-11-08","2023-11-20","2023-11-27"]
["November VAT return","2023-11-01","2023-11-30","2023-12-01","2023-12-08","2023-12-18","2023-12-27"]
["December VAT return","2023-12-01","2023-12-31","2024-01-04","2024-01-11","2024-01-19","2024-01-26"]
["January VAT return","2024-01-01","2024-01-31","2024-02-01","2024-02-08","2024-02-19","2024-02-26"]
["February VAT return","2024-02-01","2024-02-28","2024-03-01","2024-03-08","2023-03-19","2023-03-26"]
["March VAT return","2024-03-01","2024-03-31","tbc- Closedown timetable","tbc- Closedown timetable","tbc- Closedown timetable","tbc- Closedown timetable"]
[]
[null,"Termly Returns submission dates - (Annex B and Annex C)"]
[]
["*Also submit Termly Return: ","Period to : ","2023-06-30","Reports to be Received :","TBC"]
["*Also submit Termly Return: ","Period to : ","2023-12-31","Reports to be Received :","2024-01-12"]
["**Year End Workbook (YE)",null,null,"TBC/Proposed:"]
{"$rows_left_out":1}