{"text_format":"1","workbook":"xlsx","n_sheets":7,"sheets":["School List","Start","DATA","DFES","SBS File Check","October figures 18 AY 18-19","AY 19-20 Sept to Marc"],"not_rendered":{"charts":0,"images":2,"macros":1,"external_links":2,"defined_names":13,"comments":0,"pivot_tables":0},"unopened":[],"bounds":{"document_bytes":16777216,"sheet_cells":100000,"rows_first":2000,"rows_last":500,"rows_between":2000,"halvings":0,"cell_chars":16384,"cell_head_chars":4096},"cells_cut":0,"cells_raw":0,"read":"whole","date_system":"1900"}

{"sheet":"School List","index":0,"n_rows":193,"n_cols":82,"rows_kept":193,"cut":false,"hidden":true,"merged":[[0,3,4,3],[0,8,4,8],[0,4,4,4]]}
[null,null,null,null,null,null,null,null,null,null,null,null,null,null,null,null,null,null,null,null,null,null,null,null,null,null,null,null,null,null,null,null,null,null,null,null,null,null,null,null,null,null,null,null,null,null,null,null,null,null,null,null,null,null,null,null,null,null,null,null,null,null,null,null,null,null,null,null,null,null,null,null,null,null,null,null,null,null,null,null,null,"ok"]
[]
[]
["DFE",null,"School"]
["Number",null,"Name"]
[3318,null,"ABBEY RC JI "]
[2010,null,"ADDERLEY JI "]
[5949,null,"AL-FURQAN JI "]
[2153,null,"ALLENS CROFT JI "]
[2062,null,"ANDERTON PARK JI NC"]
[2479,null,"ANGLESEY JI NC"]
[2300,null,"ARDEN JI NC"]
[2026,null,"BANNERS GATE PRIMARY SCHOOL JI NC"]
[2014,null,"BARFORD JI NC"]
[2239,null,"BELLFIELD I NC"]
[2241,null,"BELLFIELD J "]
[2456,null,"BELLS FARM JI "]
[2435,null,"BENSON JI NC"]
[2025,null,"BIRCHES GREEN I NC"]
[2024,null,"BIRCHES GREEN J "]
{"$rows_left_out":174}
{"sheet":"Start","index":1,"n_rows":288,"n_cols":10,"rows_kept":288,"cut":false,"hidden":false,"merged":[]}
["V2 Final 19-20",null,null,{"$f":"IF(ISNA(VLOOKUP($E$1,$A$101:$B$306,2,0)),0,VLOOKUP($E$1,$A$101:$B$306,2,0))","v":2293},{"$f":"+DFES!E1","v":2293}]
[]
[]
[]
[]
[]
[]
[]
[]
[null,"2019/20 Primary PE and Sports Premium Grant Allocations - Official Notification"]
[]
[null,"Please Left Click on the Macro Button below to continue."]
[null,"If the aforementioned does not function, please consult the Macro Guidance here…."]
[null,"Should the Protected View message be visible on the Toolbar, click on Enable Editing."]
[]
[]
[]
[]
[]
[]
{"$rows_left_out":269}
{"sheet":"DATA","index":2,"n_rows":44,"n_cols":13,"rows_kept":44,"cut":false,"hidden":true,"merged":[[6,4,6,12],[12,6,12,13],[13,6,13,11],[16,4,17,12],[7,4,7,13],[8,4,8,13],[10,4,10,13],[9,4,9,13]]}
[]
[]
[]
[]
[]
[]
[]
[null,null,null,null,"School Budget Share Addition"]
[null,null,null,null,"PE & SPORT PREMIUM ALLOCATIONS"]
[null,null,null,null,"Financial Year 2019/20"]
[]
[]
[null,null,null,null,"School Name:",null,{"$f":"+DFES!G1","v":"William Murdoch Primary School"}]
[null,null,null,null,"DFE No:",null,{"$f":"+DFES!E1","v":2293}]
[]
[]
[null,null,null,null,"School Budget Share Addition Allocation Analysis"]
[]
[]
[null,null,null,null,null,null,null,null,null,"No. of Eligible Pupils","Allocation\n£",null,"Proportion Allocated within 2019/20 Financial Year  £"]
{"$rows_left_out":25}
{"sheet":"DFES","index":3,"n_rows":485,"n_cols":61,"rows_kept":485,"cut":false,"hidden":true,"merged":[[7,33,7,38],[7,40,7,41]]}
[null,null,null,null,2293,{"$f":"IF(ISERROR(VLOOKUP(E1,C10:L215,2,0)),0,VLOOKUP(E1,C10:L215,2,0))","v":"William Murdoch Primary School"},{"$f":"IF(ISERROR(VLOOKUP(E1,C10:L215,2,0)),0,VLOOKUP(E1,C10:L215,2,0))","v":"William Murdoch Primary School"}]
[null,1,1,2,3,4,5,null,null,null,null,null,null,null,null,null,null,null,null,null,null,null,null,null,null,null,null,null,null,29,30,31,32,33,34,35,36,37,38,39,40,41,42,43,44,45,46,47,48,49,50,51,52,53,54,55,56,57,58,59,60]
[]
[]
[]
[]
[null,null,null,null,null,null,null,null,null,null,null,null,null,null,null,null,null,null,null,null,null,null,null,null,null,null,null,null,null,null,null,null,null,null,null,null,null,null,null,null,null,null,null,null,null,null,null,null,null,null,null,null,49]
[]
["LA No.","LA Name","LAEstab (at September 2014)","School Name latest list"]
[330,"Birmingham",1100,"City of Birmingham School"]
[330,"Birmingham",2004,"Mapledene Primary School"]
[330,"Birmingham",2005,"Kings Heath Primary School"]
[330,"Birmingham",2008,"Shaw Hill Primary School"]
[330,"Birmingham",2010,"Adderley Primary School"]
[330,"Birmingham",2011,"Wheelers Lane Primary School"]
[330,"Birmingham",2014,"Barford Primary School"]
[330,"Birmingham",2015,"James Watt Primary School"]
[330,"Birmingham",2016,"Beeches Junior School"]
[330,"Birmingham",2017,"Beeches Infant School"]
[330,"Birmingham",2018,"The Oaks Primary School"]
{"$rows_left_out":466}
{"sheet":"SBS File Check","index":4,"n_rows":269,"n_cols":10,"rows_kept":269,"cut":false,"hidden":true,"merged":[]}
[null,"2018/19 SCHOOL BUDGET SHARE ADDITIONS file as at 02/5/2019"]
[null,"DOE No","Fund Centre","Cheque Book","School Name","Fair Funding\nFormula\nBudget Share\n","PE and Sport Grant"]
[]
[null,1027,"REAYW","","ADDERLEY Nurs",0,null,null,{"$f":"IFERROR(VLOOKUP(B4,'October figures 18 AY 18-19'!$B$3:$G$208,6,FALSE),0)-G4","v":0}]
[null,1017,"REAYX","CB","ALLENS CROFT Nurs",2300100007,null,null,{"$f":"IFERROR(VLOOKUP(B5,'October figures 18 AY 18-19'!$B$3:$G$208,6,FALSE),0)-G5","v":0}]
[null,1025,"REAYY","","BLOOMSBURY Nurs",0,null,null,{"$f":"IFERROR(VLOOKUP(B6,'October figures 18 AY 18-19'!$B$3:$G$208,6,FALSE),0)-G6","v":0}]
[null,1001,"REAYZ","","BORDESLEY GREEN Nurs",0,null,null,{"$f":"IFERROR(VLOOKUP(B7,'October figures 18 AY 18-19'!$B$3:$G$208,6,FALSE),0)-G7","v":0}]
[null,1002,"REAZA","","BREARLEY ST Nurs",0,null,null,{"$f":"IFERROR(VLOOKUP(B8,'October figures 18 AY 18-19'!$B$3:$G$208,6,FALSE),0)-G8","v":0}]
[null,1048,"REAZB","","CASTLE VALE Nurs",0,null,null,{"$f":"IFERROR(VLOOKUP(B9,'October figures 18 AY 18-19'!$B$3:$G$208,6,FALSE),0)-G9","v":0}]
[null,1802,"REAYF","","EDITH CADBURY Nrsy ",0,null,null,{"$f":"IFERROR(VLOOKUP(B10,'October figures 18 AY 18-19'!$B$3:$G$208,6,FALSE),0)-G10","v":0}]
[null,1026,"REAZC","","FEATHERSTONE Nurs",0,null,null,{"$f":"IFERROR(VLOOKUP(B11,'October figures 18 AY 18-19'!$B$3:$G$208,6,FALSE),0)-G11","v":0}]
[null,1006,"REAZD","","GARRETTS GREEN Nurs",0,null,null,{"$f":"IFERROR(VLOOKUP(B12,'October figures 18 AY 18-19'!$B$3:$G$208,6,FALSE),0)-G12","v":0}]
[null,1015,"REAZE","","GOODWAY Nurs",0,null,null,{"$f":"IFERROR(VLOOKUP(B13,'October figures 18 AY 18-19'!$B$3:$G$208,6,FALSE),0)-G13","v":0}]
[null,1022,"REAZF","","GRACELANDS Nurs",0,null,null,{"$f":"IFERROR(VLOOKUP(B14,'October figures 18 AY 18-19'!$B$3:$G$208,6,FALSE),0)-G14","v":0}]
[null,1010,"REAZG","","HIGHFIELD Nurs",0,null,null,{"$f":"IFERROR(VLOOKUP(B15,'October figures 18 AY 18-19'!$B$3:$G$208,6,FALSE),0)-G15","v":0}]
[null,1021,"REAZH","","HIGHTERS HEATH Nurs",0,null,null,{"$f":"IFERROR(VLOOKUP(B16,'October figures 18 AY 18-19'!$B$3:$G$208,6,FALSE),0)-G16","v":0}]
[null,1023,"REAZJ","","JAKEMAN Nurs",0,null,null,{"$f":"IFERROR(VLOOKUP(B17,'October figures 18 AY 18-19'!$B$3:$G$208,6,FALSE),0)-G17","v":0}]
[null,1016,"REAZK","","KINGS NORTON Nurs",0,null,null,{"$f":"IFERROR(VLOOKUP(B18,'October figures 18 AY 18-19'!$B$3:$G$208,6,FALSE),0)-G18","v":0}]
[null,1024,"REAZL","","LILLIAN DE LISSA Nurs",0,null,null,{"$f":"IFERROR(VLOOKUP(B19,'October figures 18 AY 18-19'!$B$3:$G$208,6,FALSE),0)-G19","v":0}]
[null,1012,"REAZM","","MARSH HILL Nurs",0,null,null,{"$f":"IFERROR(VLOOKUP(B20,'October figures 18 AY 18-19'!$B$3:$G$208,6,FALSE),0)-G20","v":0}]
{"$rows_left_out":250}
{"sheet":"October figures 18 AY 18-19","index":5,"n_rows":209,"n_cols":18,"rows_kept":209,"cut":false,"hidden":true,"merged":[]}
["Primary PE and Sports Premium Allocations - AY 2018 to 2019",null,null,null,null,null,null,null,null,null,null,null,null,null,null,null,null,"Funding for 2016 to 2017"]
["LAEstab (at Sep 18)",null,"School Name (at Sep 18)","Eligible Pupils","Total Allocation","October 2018 payment","April 2019 payment",null,null,null,null,null,null,null,null,null,null,"Schools with 16 or fewer eligible pupils receive £500 per pupil."]
[null,null,null,null,null,null,null,null,null,null,null,null,null,null,null,null,null,"Schools with 17 or more eligible pupils receive £8,000 and an additional payment of £5 per pupil."]
[3301100,1100,"City of Birmingham School",110,17100,9975,7125,{"$f":"(VLOOKUP(B4,'SBS File Check'!B:G,6,FALSE)-G4)","v":0},null,{"$f":"(((16000+(D4*10))/12*7)-F4)","v":0},null,{"$f":"VLOOKUP(B4+3300000,'AY 19-20 Sept to Marc'!C:D,2,FALSE)","v":"City of Birmingham School"}]
[3302004,2004,"Mapledene Primary School",281,18810,10973,7837,{"$f":"(VLOOKUP(B5,'SBS File Check'!B:G,6,FALSE)-G5)","v":0},null,{"$f":"(((16000+(D5*10))/12*7)-F5)","v":-0.5},null,{"$f":"VLOOKUP(B5+3300000,'AY 19-20 Sept to Marc'!C:D,2,FALSE)","v":"Mapledene Primary School"}]
[3302005,2005,"Kings Heath Primary School",559,21590,12594,8996,{"$f":"(VLOOKUP(B6,'SBS File Check'!B:G,6,FALSE)-G6)","v":0},null,0.16666666666787933,null,{"$f":"VLOOKUP(B6+3300000,'AY 19-20 Sept to Marc'!C:D,2,FALSE)","v":"Kings Heath Primary School"}]
[3302008,2008,"Shaw Hill Primary School",364,19640,11457,8183,{"$f":"(VLOOKUP(B7,'SBS File Check'!B:G,6,FALSE)-G7)","v":0},null,-0.33333333333212067,null,{"$f":"VLOOKUP(B7+3300000,'AY 19-20 Sept to Marc'!C:D,2,FALSE)","v":"Shaw Hill Primary School"}]
[3302010,2010,"Adderley Primary School",522,21220,12378,8842,{"$f":"(VLOOKUP(B8,'SBS File Check'!B:G,6,FALSE)-G8)","v":0},null,0.33333333333212067,null,{"$f":"VLOOKUP(B8+3300000,'AY 19-20 Sept to Marc'!C:D,2,FALSE)","v":"Adderley Primary School"}]
[3302011,2011,"Wheelers Lane Primary School",539,21390,12478,8912,{"$f":"(VLOOKUP(B9,'SBS File Check'!B:G,6,FALSE)-G9)","v":0},null,-0.5,null,{"$f":"VLOOKUP(B9+3300000,'AY 19-20 Sept to Marc'!C:D,2,FALSE)","v":"Wheelers Lane Primary School"}]
[3302014,2014,"Barford Primary School",351,19510,11381,8129,{"$f":"(VLOOKUP(B10,'SBS File Check'!B:G,6,FALSE)-G10)","v":0},null,-0.16666666666787933,null,{"$f":"VLOOKUP(B10+3300000,'AY 19-20 Sept to Marc'!C:D,2,FALSE)","v":"Barford Primary School"}]
[3302015,2015,"James Watt Primary School",360,19600,11433,8167,{"$f":"(VLOOKUP(B11,'SBS File Check'!B:G,6,FALSE)-G11)","v":0},null,0.33333333333212067,null,{"$f":"VLOOKUP(B11+3300000,'AY 19-20 Sept to Marc'!C:D,2,FALSE)","v":"James Watt Primary School"}]
[3302016,2016,"Beeches Junior School",363,19630,11451,8179,{"$f":"(VLOOKUP(B12,'SBS File Check'!B:G,6,FALSE)-G12)","v":0},null,-0.16666666666787933,null,{"$f":"VLOOKUP(B12+3300000,'AY 19-20 Sept to Marc'!C:D,2,FALSE)","v":"Beeches Junior School"}]
[3302017,2017,"Beeches Infant School",178,17780,10372,7408,{"$f":"(VLOOKUP(B13,'SBS File Check'!B:G,6,FALSE)-G13)","v":0},null,-0.33333333333212067,null,{"$f":"VLOOKUP(B13+3300000,'AY 19-20 Sept to Marc'!C:D,2,FALSE)","v":"Beeches Infant School"}]
[3302018,2018,"The Oaks Primary School",315,19150,11171,7979,{"$f":"(VLOOKUP(B14,'SBS File Check'!B:G,6,FALSE)-G14)","v":0},null,-0.16666666666787933,null,{"$f":"VLOOKUP(B14+3300000,'AY 19-20 Sept to Marc'!C:D,2,FALSE)","v":"The Oaks Primary School"}]
[3302019,2019,"West Heath Primary School",355,19550,11404,8146,{"$f":"(VLOOKUP(B15,'SBS File Check'!B:G,6,FALSE)-G15)","v":0},null,0.16666666666787933,null,{"$f":"VLOOKUP(B15+3300000,'AY 19-20 Sept to Marc'!C:D,2,FALSE)","v":"West Heath Primary School"}]
[3302021,2021,"Paganel Primary School",328,19280,11247,8033,{"$f":"(VLOOKUP(B16,'SBS File Check'!B:G,6,FALSE)-G16)","v":0},null,-0.33333333333212067,null,{"$f":"VLOOKUP(B16+3300000,'AY 19-20 Sept to Marc'!C:D,2,FALSE)","v":"Paganel Primary School"}]
[3302024,2024,"Birches Green Junior School",223,18230,10634,7596,{"$f":"(VLOOKUP(B17,'SBS File Check'!B:G,6,FALSE)-G17)","v":0},null,0.16666666666787933,null,{"$f":"VLOOKUP(B17+3300000,'AY 19-20 Sept to Marc'!C:D,2,FALSE)","v":"Birches Green Junior School"}]
[3302025,2025,"Birches Green Infant School",116,17160,10010,7150,{"$f":"(VLOOKUP(B18,'SBS File Check'!B:G,6,FALSE)-G18)","v":0},null,0,null,{"$f":"VLOOKUP(B18+3300000,'AY 19-20 Sept to Marc'!C:D,2,FALSE)","v":"Birches Green Infant School"}]
[3302026,2026,"Banners Gate Primary School",325,19250,11229,8021,{"$f":"(VLOOKUP(B19,'SBS File Check'!B:G,6,FALSE)-G19)","v":0},null,0.16666666666787933,null,{"$f":"VLOOKUP(B19+3300000,'AY 19-20 Sept to Marc'!C:D,2,FALSE)","v":"Banners Gate Primary School"}]
[3302030,2030,"Bordesley Green Primary School",598,21980,12822,9158,{"$f":"(VLOOKUP(B20,'SBS File Check'!B:G,6,FALSE)-G20)","v":0},null,-0.33333333333212067,null,{"$f":"VLOOKUP(B20+3300000,'AY 19-20 Sept to Marc'!C:D,2,FALSE)","v":"Bordesley Green Primary School"}]
{"$rows_left_out":190}
{"sheet":"AY 19-20 Sept to Marc","index":6,"n_rows":195,"n_cols":14,"rows_kept":195,"cut":false,"hidden":true,"merged":[]}
["LA No.","LA Name","LAEstab (at Sept 19)","School Name (at Sept 19)","Eligible Pupils","Total Allocation","October / February payment","April payment",null,null,"Formula check"]
[330,"Birmingham",3301100,"City of Birmingham School",110,17100,9975,7125,null,{"$f":"VLOOKUP(C2-3300000,'[2]School List'!A:D,4,FALSE)","v":"EPA"},{"$f":"(E2*10)+16000-F2","v":0},null,{"$f":"VLOOKUP(C2-3300000,'October figures 18 AY 18-19'!$B$4:$C$206,2,FALSE)","v":"City of Birmingham School"}]
[330,"Birmingham",3302004,"Mapledene Primary School",291,18910,11031,7879,null,{"$f":"VLOOKUP(C3-3300000,'[2]School List'!A:D,4,FALSE)","v":"Non Chq Bk"},{"$f":"(E3*10)+16000-F3","v":0},null,{"$f":"VLOOKUP(C3-3300000,'October figures 18 AY 18-19'!$B$4:$C$206,2,FALSE)","v":"Mapledene Primary School"}]
[330,"Birmingham",3302005,"Kings Heath Primary School",562,21620,12612,9008,null,{"$f":"VLOOKUP(C4-3300000,'[2]School List'!A:D,4,FALSE)","v":"Non Chq Bk"},0,null,{"$f":"VLOOKUP(C4-3300000,'October figures 18 AY 18-19'!$B$4:$C$206,2,FALSE)","v":"Kings Heath Primary School"}]
[330,"Birmingham",3302008,"Shaw Hill Primary School",370,19700,11492,8208,null,{"$f":"VLOOKUP(C5-3300000,'[2]School List'!A:D,4,FALSE)","v":"EPA"},0,null,{"$f":"VLOOKUP(C5-3300000,'October figures 18 AY 18-19'!$B$4:$C$206,2,FALSE)","v":"Shaw Hill Primary School"}]
[330,"Birmingham",3302010,"Adderley Primary School",496,20960,12227,8733,null,{"$f":"VLOOKUP(C6-3300000,'[2]School List'!A:D,4,FALSE)","v":"Chq Bk"},0,null,{"$f":"VLOOKUP(C6-3300000,'October figures 18 AY 18-19'!$B$4:$C$206,2,FALSE)","v":"Adderley Primary School"}]
[330,"Birmingham",3302011,"Wheelers Lane Primary School",540,21400,12483,8917,null,{"$f":"VLOOKUP(C7-3300000,'[2]School List'!A:D,4,FALSE)","v":"Chq Bk"},0,null,{"$f":"VLOOKUP(C7-3300000,'October figures 18 AY 18-19'!$B$4:$C$206,2,FALSE)","v":"Wheelers Lane Primary School"}]
[330,"Birmingham",3302014,"Barford Primary School",359,19590,11428,8162,null,{"$f":"VLOOKUP(C8-3300000,'[2]School List'!A:D,4,FALSE)","v":"Non Chq Bk"},0,null,{"$f":"VLOOKUP(C8-3300000,'October figures 18 AY 18-19'!$B$4:$C$206,2,FALSE)","v":"Barford Primary School"}]
[330,"Birmingham",3302015,"James Watt Primary School",356,19560,11410,8150,null,{"$f":"VLOOKUP(C9-3300000,'[2]School List'!A:D,4,FALSE)","v":"Chq Bk"},0,null,{"$f":"VLOOKUP(C9-3300000,'October figures 18 AY 18-19'!$B$4:$C$206,2,FALSE)","v":"James Watt Primary School"}]
[330,"Birmingham",3302016,"Beeches Junior School",361,19610,11439,8171,null,{"$f":"VLOOKUP(C10-3300000,'[2]School List'!A:D,4,FALSE)","v":"Non Chq Bk"},0,null,{"$f":"VLOOKUP(C10-3300000,'October figures 18 AY 18-19'!$B$4:$C$206,2,FALSE)","v":"Beeches Junior School"}]
[330,"Birmingham",3302017,"Beeches Infant School",180,17800,10383,7417,null,{"$f":"VLOOKUP(C11-3300000,'[2]School List'!A:D,4,FALSE)","v":"Non Chq Bk"},0,null,{"$f":"VLOOKUP(C11-3300000,'October figures 18 AY 18-19'!$B$4:$C$206,2,FALSE)","v":"Beeches Infant School"}]
[330,"Birmingham",3302018,"The Oaks Primary School",329,19290,11253,8037,null,{"$f":"VLOOKUP(C12-3300000,'[2]School List'!A:D,4,FALSE)","v":"Non Chq Bk"},0,null,{"$f":"VLOOKUP(C12-3300000,'October figures 18 AY 18-19'!$B$4:$C$206,2,FALSE)","v":"The Oaks Primary School"}]
[330,"Birmingham",3302019,"West Heath Primary School",348,19480,11363,8117,null,{"$f":"VLOOKUP(C13-3300000,'[2]School List'!A:D,4,FALSE)","v":"Non Chq Bk"},0,null,{"$f":"VLOOKUP(C13-3300000,'October figures 18 AY 18-19'!$B$4:$C$206,2,FALSE)","v":"West Heath Primary School"}]
[330,"Birmingham",3302021,"Paganel Primary School",349,19490,11369,8121,null,{"$f":"VLOOKUP(C14-3300000,'[2]School List'!A:D,4,FALSE)","v":"EPA"},0,null,{"$f":"VLOOKUP(C14-3300000,'October figures 18 AY 18-19'!$B$4:$C$206,2,FALSE)","v":"Paganel Primary School"}]
[330,"Birmingham",3302024,"Birches Green Junior School",230,18300,10675,7625,null,{"$f":"VLOOKUP(C15-3300000,'[2]School List'!A:D,4,FALSE)","v":"Non Chq Bk"},0,null,{"$f":"VLOOKUP(C15-3300000,'October figures 18 AY 18-19'!$B$4:$C$206,2,FALSE)","v":"Birches Green Junior School"}]
[330,"Birmingham",3302025,"Birches Green Infant School",117,17170,10016,7154,null,{"$f":"VLOOKUP(C16-3300000,'[2]School List'!A:D,4,FALSE)","v":"Non Chq Bk"},0,null,{"$f":"VLOOKUP(C16-3300000,'October figures 18 AY 18-19'!$B$4:$C$206,2,FALSE)","v":"Birches Green Infant School"}]
[330,"Birmingham",3302026,"Banners Gate Primary School",317,19170,11183,7987,null,{"$f":"VLOOKUP(C17-3300000,'[2]School List'!A:D,4,FALSE)","v":"EPA"},0,null,{"$f":"VLOOKUP(C17-3300000,'October figures 18 AY 18-19'!$B$4:$C$206,2,FALSE)","v":"Banners Gate Primary School"}]
[330,"Birmingham",3302030,"Bordesley Green Primary School",599,21990,12828,9162,null,{"$f":"VLOOKUP(C18-3300000,'[2]School List'!A:D,4,FALSE)","v":"Chq Bk"},0,null,{"$f":"VLOOKUP(C18-3300000,'October figures 18 AY 18-19'!$B$4:$C$206,2,FALSE)","v":"Bordesley Green Primary School"}]
[330,"Birmingham",3302040,"Cherry Orchard Primary School",378,19780,11538,8242,null,{"$f":"VLOOKUP(C19-3300000,'[2]School List'!A:D,4,FALSE)","v":"EPA"},0,null,{"$f":"VLOOKUP(C19-3300000,'October figures 18 AY 18-19'!$B$4:$C$206,2,FALSE)","v":"Cherry Orchard Primary School"}]
[330,"Birmingham",3302053,"Colmore Junior School",480,20800,12133,8667,null,{"$f":"VLOOKUP(C20-3300000,'[2]School List'!A:D,4,FALSE)","v":"Chq Bk"},0,null,{"$f":"VLOOKUP(C20-3300000,'October figures 18 AY 18-19'!$B$4:$C$206,2,FALSE)","v":"Colmore Junior School"}]
{"$rows_left_out":175}