{"text_format":"1","workbook":"xlsx","n_sheets":7,"sheets":["Start","School List","Allocation","DFES","DFE Notification 18-19","DFE Notification 17-18","DFE Notification 16-17"],"not_rendered":{"charts":0,"images":2,"macros":1,"external_links":0,"defined_names":11,"comments":0,"pivot_tables":0},"unopened":[],"bounds":{"document_bytes":16777216,"sheet_cells":100000,"rows_first":2000,"rows_last":500,"rows_between":2000,"halvings":0,"cell_chars":16384,"cell_head_chars":4096},"cells_cut":0,"cells_raw":0,"read":"whole","date_system":"1900"}

{"sheet":"Start","index":0,"n_rows":326,"n_cols":16,"rows_kept":326,"cut":false,"hidden":false,"merged":[]}
[null,null,null,{"$f":"IF(ISNA(VLOOKUP($E$1,$A$100:$B$598,2,0)),0,VLOOKUP($E$1,$A$100:$B$598,2,0))","v":2183},{"$f":"+DFES!E1","v":2183},null,null,null,null,null,null,null,null,null,"Allocation",{"$f":"IF(ISNA(VLOOKUP($E$1,DFES!$A$10:$J$438,3,0)),0,VLOOKUP($E$1,DFES!$A$10:$J$438,3,0))","v":2640}]
[]
[]
[]
[]
[]
[]
[]
[null,"2018/19 Free School Meals Supplementary Grant"]
[]
[null,"Please Left Click on the Macro Button below to continue."]
[null,"If the aforementioned does not function, please refer to the Macro Guidance on the budget pages>>.",null,null,null,null,null,null,null,null,null,null,"macro guidance"]
[null,"Should the Protected View message be visible on the Toolbar, click on Enable Editing."]
[]
[]
[]
[]
[]
[]
[]
[]
[]
[]
[]
[]
[]
[]
[]
[]
[]
[]
[]
[]
[]
[]
[]
[]
[]
[]
[]
[]
[]
[]
[]
[]
[]
[]
[]
[]
[]
[]
[]
[]
[]
[]
[]
[]
[]
[]
[]
[]
[]
[]
[]
[]
[]
[]
[]
[]
[]
[]
[]
[]
[]
[]
[]
[]
[]
[]
[]
[]
[]
[]
[]
[]
[]
[]
[]
[]
[]
[]
[]
[]
[]
[]
[]
[]
[]
[]
[1100,1100,null,null,null,null,null,null,"Nrsy","N"]
[2004,2004,null,null,null,null,null,null,"J","P"]
[2005,2005,null,null,null,null,null,null,"I","P"]
[2008,2008,null,null,null,null,null,null,"JI","P"]
[2010,2010,null,null,null,null,null,null,"Sec (16+)","SEC"]
[2011,2011,null,null,null,null,null,null,"Sec","SEC"]
[2014,2014,null,null,null,null,null,null,"Spcl","SPEC"]
[2015,2015]
[2016,2016]
[2017,2017]
[2018,2018]
[2021,2021]
[2024,2024]
[2025,2025]
[2026,2026]
[2030,2030]
[2040,2040]
[2052,2052]
[2053,2053]
[2054,2054]
[2055,2055]
[2062,2062]
[2063,2063]
[2067,2067]
[2079,2079]
[2081,2081]
[2087,2087]
[2091,2091]
[2092,2092]
[2097,2097]
[2099,2099]
[2108,2108]
[2115,2115]
[2118,2118]
[2119,2119]
[2127,2127]
[2128,2128]
[2129,2129]
[2133,2133]
[2142,2142]
[2149,2149]
[2150,2150]
[2153,2153]
[2155,2155]
[2157,2157]
[2159,2159]
[2160,2160]
[2161,2161]
[2169,2169]
[2174,2174]
[2176,2176]
[2178,2178]
[2179,2179]
[2183,2183]
[2184,2184]
[2185,2185]
[2189,2189]
[2190,2190]
[2191,2191]
[2192,2192]
[2225,2225]
[2227,2227]
[2231,2231]
[2236,2236]
[2238,2238]
[2239,2239]
[2241,2241]
[2245,2245]
[2246,2246]
[2251,2251]
[2254,2254]
[2276,2276]
[2278,2278]
[2288,2288]
[2289,2289]
[2293,2293]
[2296,2296]
[2300,2300]
[2306,2306]
[2308,2308]
[2312,2312]
[2313,2313]
[2314,2314]
[2317,2317]
[2321,2321]
[2401,2401]
[2402,2402]
[2412,2412]
[2416,2416]
[2420,2420]
[2425,2425]
[2429,2429]
[2435,2435]
[2436,2436]
[2438,2438]
[2441,2441]
[2445,2445]
[2454,2454]
[2456,2456]
[2457,2457]
[2462,2462]
[2464,2464]
[2465,2465]
[2466,2466]
[2469,2469]
[2474,2474]
[2477,2477]
[2478,2478]
[2479,2479]
[2482,2482]
[2485,2485]
[2486,2486]
[3002,3002]
[3003,3003]
[3010,3010]
[3016,3016]
[3019,3019]
[3025,3025]
[3302,3302]
[3307,3307]
[3310,3310]
[3316,3316]
[3317,3317]
[3318,3318]
[3319,3319]
[3320,3320]
[3321,3321]
[3322,3322]
[3323,3323]
[3325,3325]
[3327,3327]
[3328,3328]
[3329,3329]
[3331,3331]
[3335,3335]
[3337,3337]
[3339,3339]
[3344,3344]
[3346,3346]
[3347,3347]
[3349,3349]
[3351,3351]
[3352,3352]
[3353,3353]
[3355,3355]
[3357,3357]
[3359,3359]
[3360,3360]
[3361,3361]
[3365,3365]
[3367,3367]
[3371,3371]
[3372,3372]
[3375,3375]
[3377,3377]
[3380,3380]
[3381,3381]
[3382,3382]
[3385,3385]
[3386,3386]
[3406,3406]
[3409,3409]
[3410,3410]
[3411,3411]
[3421,3421]
[3428,3428]
[3431,3431]
[3432,3432]
[3435,3435]
[3436,3436]
[4015,4015]
[4063,4063]
[4173,4173]
[4187,4187]
[4188,4188]
[4193,4193]
[4201,4201]
[4237,4237]
[4333,4333]
[4334,4334]
[4606,4606]
[4625,4625]
[4801,4801]
[4804,4804]
[5202,5202]
[5203,5203]
[5413,5413]
[5415,5415]
[5949,5949]
[7006,7006]
[7009,7009]
[7012,7012]
[7014,7014]
[7016,7016]
[7026,7026]
[7030,7030]
[7033,7033]
[7034,7034]
[7035,7035]
[7036,7036]
[7037,7037]
[7040,7040]
[7045,7045]
[7047,7047]
[7050,7050]
[7051,7051]
[7052,7052]
[7053,7053]
[7060,7060]
[7062,7062]
[4115,4115]
[3354,3354]
[5416,5416]
[2284,2284]
[2294,2294]
[2093,2093]
[4223,4223]
[4664,4664]
[4301,4301]
[2406,2406]
[4245,4245]
[4177,4177]
[4663,4663]
[3383,3383]
[3363,3363]
[3342,3342]
[2019,2019]

{"sheet":"School List","index":1,"n_rows":434,"n_cols":79,"rows_kept":434,"cut":false,"hidden":true,"merged":[[0,2,4,2],[0,5,4,5],[0,3,4,3]]}
[null,null,null,null,null,null,null,null,null,null,null,null,null,null,null,null,null,null,null,null,null,null,null,null,null,null,null,null,null,null,null,null,null,null,null,null,null,null,null,null,null,null,null,null,null,null,null,null,null,null,null,null,null,null,null,null,null,null,null,null,null,null,null,null,null,null,null,null,null,null,null,null,null,null,null,null,null,null,"ok"]
[]
[]
["DFE","School"]
["Number","Name"]
[3318,"ABBEY RC JI "]
[2020,"ACOCKS GREEN ACADEMY"]
[2010,"ADDERLEY JI "]
[1027,"ADDERLEY Nrsy "]
[3433,"ALBERT BRADBEER JI NC"]
[5949,"AL-FURQAN JI "]
[4334,"AL-HIJRAH Sec "]
[2153,"ALLENS CROFT JI "]
[1017,"ALLENS CROFT Nrsy "]
[2472,"ALSTON JI NC"]
[2062,"ANDERTON PARK JI NC"]
[2479,"ANGLESEY JI NC"]
[4804,"ARCHBISHOP ILSLEY RC Sec (16+) "]
[2300,"ARDEN JI NC"]
[2041,"ARK ROSE ACADEMY"]
[2056,"ARK TINDAL ACADEMY"]
[4307,"ARTHUR TERRY ACAD Sec (16+) "]
[4220,"ASTON MANOR ACADEMY"]
[2443,"ASTON TOWER JI NC"]
[3412,"AUDLEY JI NC"]
[4333,"BALAAM WOOD Sec "]
[2026,"BANNERS GATE PRIMARY SCHOOL JI NC"]
[2014,"BARFORD JI NC"]
[4108,"BARTLEY GREEN ACADEMY"]
[7016,"BASKERVILLE Spcl"]
[5400,"BAVERSTOCK ACADEMY (16+) "]
[7052,"BEAUFORT Spcl"]
[2239,"BELLFIELD I NC"]
[2241,"BELLFIELD J "]
[2456,"BELLS FARM JI "]
[2435,"BENSON JI NC"]
[2072,"BILLESLEY ACADEMY"]
[2025,"BIRCHES GREEN I NC"]
[2024,"BIRCHES GREEN J "]
[2297,"BIRCHFIELD JI NC"]
[5413,"BISHOP CHALLONER Sec (16+) "]
[4660,"BISHOP VESEY'S ACAD Sec (16+) "]
[4661,"BISHOP WALSH RC Sec (16+) "]
[2107,"BLAKENHALE ACAD J "]
[2102,"BLAKENHALE I ACAD"]
[2254,"BLAKESLEY HALL JI "]
[1025,"BLOOMSBURY Nrsy "]
[2402,"BOLDMERE I NC"]
[2401,"BOLDMERE J "]
[4115,"BORDESLEY GREEN GIRLS Sec (16+) "]
[2030,"BORDESLEY GREEN JI NC"]
[1001,"BORDESLEY GREEN Nrsy "]
[2002,"BORDESLEY VILLAGE JI NC"]
[3354,"BOURNVILLE I "]
[3353,"BOURNVILLE J "]
[4238,"BOURNVILLE Sec (16+) "]
[7030,"BRAIDWOOD Spcl"]
[7038,"BRAYS Spcl"]
[1002,"BREARLEY ST Nrsy "]
[7049,"BRIDGE Spcl"]
[2238,"BROADMEADOW I NC"]
[2236,"BROADMEADOW J "]
[4227,"BROADWAY ACADEMY(16+) "]
[2034,"BROOKFIELDS JI NC"]
[2295,"BROOKVALE ACADEMY"]
[2035,"BROWNMEAD JI "]
[2465,"CALSHOT JI NC"]
[7013,"CALTHORPE Spcl"]
[2039,"CANTERBURY CROSS JI NC"]
[4801,"CARDINAL WISEMAN RC Sec "]
[1048,"CASTLE VALE Nrsy "]
[2312,"CHAD VALE JI "]
[2305,"CHANDOS JI NC"]
[7051,"CHERRY OAK Spcl"]
[2040,"CHERRY ORCHARD JI NC"]
[2251,"CHILCOTE JI NC"]
[2047,"CHILWELL CROFT ACADEMY"]
[2272,"CHIVENOR JI "]
[3319,"CHRIST THE KING RC JI NC"]
[3002,"CHRISTCHURCH CE JI NC"]
[1100,"City of Birmingham"]
[2134,"CITY ROAD ACADEMY"]
[3432,"CLIFTON JI NC"]
[4233,"COCKSHUT HILL Sec (16+) "]
[2289,"COFTON JI "]
[2185,"COLEBOURNE JI "]
[2052,"COLMERS FARM I "]
[2051,"COLMERS FARM J "]
[5416,"COLMERS Sec "]
[2054,"COLMORE I NC"]
[2053,"COLMORE J "]
[2082,"CONWAY JI NC"]
[2464,"COPPICE JI "]
[3320,"CORPUS CHRISTI RC JI "]
[2055,"COTTERIDGE JI NC"]
[2299,"COTTESBROOKE I NC"]
[2226,"COTTESBROOKE J "]
[2191,"COURT FARM JI "]
[2060,"CROMWELL JI NC"]
[4129,"DAME ELIZABETH CADBURY Sec (16+) "]
[7035,"DAME ELLEN PINSENT Spcl"]
[5201,"DEANERY ACADEMY"]
[2284,"DEYKIN AVENUE JI "]
[2065,"DORRINGTON ACADEMY"]
[1802,"EDITH CADBURY Nrsy "]
[2454,"ELMS FARM JI NC"]
[3321,"ENGLISH MARTYRS RC JI "]
[2036,"ERDINGTON HALL ACADEMY"]
[5410,"FAIRFAX ACAD Sec (16+) "]
[2310,"FAIRWAY ACADEMY"]
[2294,"FEATHERSTONE JI "]
[1026,"FEATHERSTONE Nrsy "]
[2475,"FIRS JI NC"]
[2486,"FORESTDALE JI NC"]
[2437,"FOUNDRY JI NC"]
[2109,"FOUR DWELLINGS ACADEMY"]
[4005,"FOUR DWELLINGS ACADEMY"]
[3435,"FOUR OAKS JI "]
[7050,"FOX HOLLIES Spcl"]
[1006,"GARRETTS GREEN Nrsy "]
[5412,"GEORGE DIXON ACAD Sec (16+) "]
[2079,"GEORGE DIXON JI "]
[2081,"GILBERTSTONE JI NC"]
[2296,"GLENMEAD JI "]
[4013,"GOLDEN HILLOCK ACADEMY"]
[1015,"GOODWAY Nrsy "]
[2448,"GOSSEY LANE JI NC"]
[1022,"GRACELANDS Nrsy "]
[2450,"GREAT BARR ACADEMY"]
[5403,"GREAT BARR Sec (16+) "]
[2451,"GREEN MEADOW JI "]
[2085,"GREENHOLM ACADEMY"]
[4006,"GREENWOOD ACADEMY "]
[2086,"GREET JI NC"]
[2087,"GRENDON JI NC"]
[2138,"GRESTONE ACADEMY"]
[2466,"GROVE JI NC"]
[3316,"GUARDIAN ANGELS RC JI "]
[2091,"GUNTER JI NC"]
[5409,"HALL GREEN ACAD Sec "]
[2093,"HALL GREEN I NC"]
[2092,"HALL GREEN J "]
[7027,"HALLMOOR Spcl"]
[7006,"HAMILTON Spcl"]
[4240,"HAMSTEAD HALL ACADEMY (16+) "]
[5402,"HANDSWORTH GRAMMAR Sec (16+) "]
[4207,"HANDSWORTH WOOD GIRLS ACADEMY"]
[6910,"HARBORNE HILL  ACAD"]
[2477,"HARBORNE JI "]
[3436,"HARPER BELL PRIMARY JI NC"]
[2121,"HAWKESLEY CE ACADEMY"]
[2099,"HAWTHORN JI "]
[6905,"HEARTLANDS ACAD"]
[2313,"HEATH MOUNT JI "]
[2309,"HEATHFIELD JI NC"]
[2455,"HEATHLANDS JI NC"]
[2101,"HIGHFIELD JI "]
[1010,"HIGHFIELD Nrsy "]
[2438,"HIGHTERS HEATH JI "]
[1021,"HIGHTERS HEATH Nrsy "]
[3429,"HILL WEST ACADEMY"]
[4012,"HILLCREST ACADEMY"]
[2434,"HILLSTONE JI NC"]
[2110,"HOBMOOR ACADEMY"]
[4015,"HODGE HILL GIRLS Sec "]
[3430,"HODGE HILL JI "]
[4201,"HODGE HILL Sec "]
[2429,"HOLLAND HOUSE I NC"]
[3411,"HOLLY HILL I NC"]
[2474,"HOLLYFIELD JI "]
[2288,"HOLLYWOOD JI "]
[4223,"HOLTE Sec (16+) "]
[3402,"HOLY CROSS RC JI "]
[3317,"HOLY FAMILY RC JI NC"]
[3327,"HOLY SOULS RC JI "]
[3303,"HOLY TRINITY CE ACADEMY"]
[4664,"HOLY TRINITY RC Sec "]
[4241,"HOLYHEAD ACADEMY"]
[7026,"HUNTERS HILL Spcl"]
[4244,"INTERNATIONAL SCHOOL & COMM.COLLEGE Sec (16+) "]
[1023,"JAKEMAN Nrsy "]
[7063,"JAMES BRINDLEY Spcl"]
[2015,"JAMES WATT JI NC"]
[2111,"JERVOISE JI NC"]
[4301,"JOHN WILLMOTT Sec (16+) "]
[3352,"KING DAVID JI NC"]
[5408,"KING EDWARD VI ASTON ACAD Sec (16+) "]
[5407,"KING EDWARD VI CAMP HILL BOYS ACAD Sec (16+) "]
[5406,"KING EDWARD VI CAMP HILL GIRLS ACAD Sec (16+) "]
[5405,"KING EDWARD VI FIVE WAYS ACAD Sec (16+) "]
[5404,"KING EDWARD VI HANDSWORTH ACAD Sec (16+) "]
[6906,"KING EDWARD VI SHELDON HEATH ACADEMY  "]
[2005,"KINGS HEATH JI NC"]
[4063,"KINGS HEATH Sec "]
[5415,"KINGS NORTON BOYS Sec (16+) "]
[5414,"KINGS NORTON GIRLS ACAD Sec (16+) "]
[4001,"KINGS NORTON HIGH ACADEMY"]
[2118,"KINGS NORTON JI "]
[1016,"KINGS NORTON Nrsy "]
[2073,"KINGS RISE ACADEMY"]
[4330,"KINGSBURY Sec "]
[2115,"KINGSLAND JI NC"]
[2441,"KINGSTHORNE JI NC"]
[2321,"KITWELL JI NC"]
[2189,"LADYPOOL JI NC"]
[2119,"LAKEY LANE JI NC"]
[7060,"LANGLEY Spcl"]
[2096,"LEA FOREST ACADEMY"]
[2453,"LEIGH JI NC"]
[1024,"LILLIAN DE LISSA Nrsy "]
[7062,"LINDSWORTH Spcl"]
[2462,"LITTLE SUTTON JI "]
[7012,"LONGWILL Spcl"]
[4057,"LORDSWOOD BOYS ACADEMY"]
[4060,"LORDSWOOD GIRLS ACADEMY"]
[2127,"LOZELLS JI NC"]
[2129,"LYNDON GREEN I "]
[2128,"LYNDON GREEN J "]
[2420,"MANEY HILL JI "]
[5204,"MANOR PARK JI NC"]
[2075,"MANSFIELD GREEN ACADEMY"]
[2004,"MAPLEDENE JI NC"]
[2132,"MARLBOROUGH I NC"]
[2283,"MARLBOROUGH J "]
[2133,"MARSH HILL JI "]
[1012,"MARSH HILL Nrsy "]
[3322,"MARYVALE RC JI NC"]
[2117,"MATTHEW BOULTON ACADEMY"]
[7040,"MAYFIELD Spcl"]
[2246,"MEADOWS JI "]
[2463,"MERE GREEN ACADEMY"]
[2100,"Merritts Brook E-ACT Primary Academy NC"]
[2406,"MINWORTH JI "]
[2070,"MONTGOMERY ACADEMY"]
[2078,"MOOR GREEN ACADEMY"]
[2416,"MOOR HALL JI "]
[3003,"MOSELEY CE JI "]
[4245,"MOSELEY Sec (16+) "]
[2038,"NANSEN ACADEMY"]
[2048,"NECHELLS ACADEMY"]
[2142,"NELSON JI NC"]
[2457,"NELSON MANDELA JI NC"]
[2469,"NEW HALL JI NC"]
[3431,"NEW OSCOTT JI NC"]
[1028,"NEWTOWN Nrsy "]
[5411,"NINESTILES ACAD"]
[2315,"NONSUCH JI "]
[6909,"NORTH BIRMINGHAM ACADEMY  "]
[2263,"NORTHFIELD MANOR JI "]
[2064,"OAKLANDS ACADEMY"]
[2018,"OAKS, THE JI NC"]
[2103,"OASIS ACADEMY SHORT HEATH"]
[2182,"OLDKNOW ACADEMY"]
[3323,"ORATORY RC JI NC"]
[2436,"OSBORNE JI "]
[1049,"OSBORNE Nrsy "]
[7053,"OSCOTT MANOR Spcl"]
[3351,"OUR LADY AND ST ROSE RC JI NC"]
[3374,"OUR LADY OF FATIMA RC JI "]
[3328,"OUR LADY OF LOURDES RC JI NC"]
[3357,"OUR LADY'S RC JI "]
[2447,"OVAL, THE JI NC"]
[2021,"PAGANEL JI NC"]
[2149,"PAGET JI NC"]
[2150,"PARK HILL JI NC"]
[4323,"PARK VIEW ACAD Sec "]
[2458,"PARKFIELD ACADEMY"]
[2452,"PEGASUS ACADEMY"]
[2425,"PENNS JI "]
[2057,"PERCY SHURMER ACADEMY"]
[4109,"PERRY BEECHES ACADEMY"]
[2017,"PERRY BEECHES I "]
[2016,"PERRY BEECHES J "]
[1008,"PERRY BEECHES Nrsy "]
[7045,"PINES Spcl"]
[4331,"PLANTSBROOK ACAD Sec (16+) "]
[7034,"PRIESTLEY SMITH Spcl"]
[2003,"PRINCE ALBERT JI NC"]
[2156,"PRINCETHORPE I NC"]
[2155,"PRINCETHORPE J "]
[4173,"QUEENSBRIDGE Sec "]
[7036,"QUEENSBURY Spcl"]
[3004,"QUINTON CE JI "]
[2157,"RADDLEBARN JI NC"]
[2080,"REASIDE ACADEMY"]
[2159,"REDHILL JI NC"]
[2161,"REDNAL HILL I NC"]
[2160,"REDNAL HILL J "]
[2063,"REGENTS PARK JI NC"]
[2460,"ROBIN HOOD ACADEMY"]
[2481,"ROOKERY ACADEMY"]
[3325,"ROSARY RC JI NC"]
[1018,"RUBERY Nrsy "]
[3409,"SACRED HEART RC JI "]
[4008,"SALTLEY Sec "]
[1000,"SELLY OAK Nrsy "]
[7033,"SELLY OAK Spcl"]
[4177,"SELLY PARK TECH COLLEGE FOR GIRLS Sec "]
[2169,"SEVERNE JI NC"]
[2008,"SHAW HILL JI NC"]
[6907,"SHENLEY COURT ACAD"]
[1038,"SHENLEY FIELDS Nrsy "]
[2058,"SHIRESTONE ACADEMY."]
[7037,"SKILTS Spcl"]
[2037,"SLADE ACADEMY"]
[2174,"SLADEFIELD I "]
[5401,"SMALL HEATH Sec (16+) "]
[2176,"SOMERVILLE JI NC"]
[7047,"SPRINGFIELD HOUSE Spcl"]
[3413,"SPRINGFIELD JI NC"]
[6908,"ST ALBAN'S CE SPEC ENGIN COLL ACAD"]
[3381,"ST ALBANS RC JI "]
[3380,"ST AMBROSE BARLOW RC JI "]
[3335,"ST ANNE'S RC JI "]
[3329,"ST AUGUSTINE'S RC JI NC"]
[3302,"ST BARNABAS CE JI NC"]
[2183,"ST BENEDICT'S I NC"]
[3372,"ST BERNADETTE'S RC JI NC"]
[3375,"ST BERNARD'S RC JI "]
[3330,"ST BRIGID'S RC JI NC"]
[3331,"ST CATHERINE'S RC JI NC"]
[3337,"ST CHAD'S RC JI "]
[3406,"ST CLARE'S RC JI NC"]
[2059,"ST CLEMENT'S ACADEMY"]
[3379,"ST COLUMBA'S RC JI "]
[3386,"ST CUTHBERTS RC JI NC"]
[3363,"ST DUNSTAN'S RC JI NC"]
[4663,"ST EDMUND CAMPION RC Sec (16+) "]
[3347,"ST EDMUND'S RC JI NC"]
[3355,"ST EDWARD'S RC JI "]
[5205,"ST FRANCIS CE JI NC"]
[3342,"ST FRANCIS RC JI "]
[2104,"ST GEORGE'S CE (B16) ACADEMY"]
[2120,"ST GEORGE'S CE (B19) ACADEMY"]
[3367,"ST GERARD'S RC JI NC"]
[3010,"ST JAMES CE JI "]
[3358,"ST JAMES RC JI "]
[3410,"ST JOHN & ST MONICA RC JI "]
[3360,"ST JOHN FISHER'S RC JI "]
[4625,"ST JOHN WALL RC Sec "]
[3306,"ST JOHN'S CE (B11) ACADEMY"]
[2071,"ST JOHN'S CE (B16) ACADEMY"]
[3356,"ST JOSEPH'S RC (B30) JI "]
[3339,"ST JOSEPH'S RC (B7) JI "]
[3401,"ST JOSEPH'S RC (B75) JI "]
[3377,"ST JUDE'S RC JI "]
[3371,"ST LAURENCE CE I "]
[3307,"ST LAURENCE CE J "]
[3361,"ST MARGARET MARY RC JI "]
[3383,"ST MARK'S RC JI "]
[3382,"ST MARTIN de PORRES RC JI "]
[3350,"ST MARY & ST JOHN RC JI NC"]
[3015,"ST MARY'S CE (B20) ACADEMY"]
[3025,"ST MARY'S CE (B29) JI "]
[3344,"ST MARY'S RC (B17) JI "]
[3016,"ST MATTHEW'S CE JI "]
[2061,"ST MICHAEL'S CE (B21) ACADEMY"]
[3311,"ST MICHAEL'S CE (B32) ACADEMY"]
[3403,"ST NICHOLAS RC JI "]
[3346,"ST PATRICK'S RC JI "]
[4606,"ST PAUL'S RC GIRLS Sec (16+) "]
[3366,"ST PAUL'S RC JI NC"]
[3362,"ST PETER & PAUL RC JI "]
[3428,"ST PETER'S CE JI NC"]
[3385,"ST PETER'S RC JI "]
[3019,"ST SAVIOUR'S CE JI "]
[3365,"ST TERESA'S RC JI "]
[4616,"ST THOMAS AQUINAS RC Sec (16+) "]
[3314,"ST THOMAS' CE JI NC"]
[3349,"ST THOMAS MORE'S RC JI "]
[1009,"ST THOMAS Nrsy "]
[3310,"ST VINCENT'S RC JI NC"]
[3359,"ST WILFRID'S RC JI NC"]
[2178,"STANVILLE JI NC"]
[2179,"STARBANK JI NC"]
[2184,"STECHFORD JI NC"]
[2188,"STIRCHLEY JI NC"]
[4206,"STOCKLAND GREEN ACADEMY"]
[2097,"STORY WOOD SCHOOL AND CHILDREN'S CENTRE  JI NC"]
[2067,"SUMMERFIELD JI NC"]
[2190,"SUNDRIDGE JI "]
[4300,"SUTTON COLDFIELD GIRLS ACADEMY"]
[4237,"SWANSHURST Sec (16+) "]
[2098,"TAME VALLEY ACADEMY"]
[2249,"THE ORCHARDS ACADEMY"]
[2192,"THORNTON JI "]
[2195,"TIMBERLEY ACADEMY"]
[2126,"TIVERTON ACADEMY"]
[2273,"TOPCLIFFE JI "]
[2408,"TOWN J "]
[4188,"TURVES GREEN BOYS Sec "]
[4187,"TURVES GREEN GIRLS Sec "]
[2442,"TURVES GREEN JI "]
[2449,"TWICKENHAM JI NC"]
[7014,"UFFCULME Spcl"]
[7009,"VICTORIA Spcl"]
[5203,"WALMLEY I NC"]
[5202,"WALMLEY J "]
[2108,"WARD END JI NC"]
[2068,"WARREN FARM ACADEMY"]
[4084,"WASHWOOD HEATH ACADEMY (16+) "]
[1019,"WASHWOOD HEATH Nrsy "]
[2306,"WATERMILL JI "]
[2482,"WATTVILLE JI NC"]
[4009,"WAVERLEY Sec (16+) "]
[2308,"WELFORD JI NC"]
[2245,"WELSH HOUSE FARM JI NC"]
[1020,"WEOLEY CASTLE Nrsy "]
[2019,"WEST HEATH JI "]
[1014,"WEST HEATH Nrsy "]
[2471,"WESTMINSTER JI NC"]
[2011,"WHEELERS LANE JI NC"]
[4193,"WHEELERS LANE Sec "]
[2478,"WHITEHOUSE COMMON JI NC"]
[2276,"WILKES GREEN I NC"]
[2293,"WILKES GREEN J "]
[7031,"WILSON STUART"]
[2445,"WOODCOCK HILL JI "]
[2278,"WOODGATE JI "]
[2136,"WOODHOUSE ACADEMY"]
[2314,"WOODTHORPE JI "]
[2105,"WOODVIEW ACADEMY"]
[2317,"WORLDS END I NC"]
[2225,"WORLDS END J "]
[2480,"WYCHALL JI NC"]
[2412,"WYLDE GREEN JI "]
[2484,"WYNDCLIFFE JI NC"]
[3421,"YARDLEY JI "]
[2227,"YARDLEY WOOD JI NC"]
[4246,"YARDLEYS ACADEMY"]
[2122,"YARNFIELD ACADEMY"]
[2485,"YENTON JI "]
[2180,"YEW TREE JI NC"]
[2231,"YORKMEAD JI NC"]

{"sheet":"Allocation","index":2,"n_rows":46,"n_cols":12,"rows_kept":46,"cut":false,"hidden":true,"merged":[[37,3,37,12],[30,3,30,9],[41,3,41,12],[42,3,42,12],[43,3,43,12],[26,3,29,9],[15,3,16,11],[6,3,6,11],[7,3,7,11],[8,3,8,11],[9,3,9,11],[11,5,11,12],[12,5,12,10]]}
[null,null,null,null,null,{"$f":"IF(E14>0,\"S\",\"P\")","v":"P"}]
[]
[]
[]
[]
[]
[]
[null,null,null,"School Budget Share Addition"]
[null,null,null,"2018/19 Free School Meals Supplementary Grant"]
[]
[]
[null,null,null,"School Name:",null,{"$f":"DFES!F1","v":"ST BENEDICT'S I NC"}]
[null,null,null,"DFE No:",null,{"$f":"DFES!E1","v":2183}]
[]
[]
[null,null,null,"School Budget Share Addition Allocation Analysis"]
[]
[]
[null,null,null,null,null,null,null,null,null,"Oct 17  Total FSM number of pupils","Oct 18 Total FSM number of pupils","Change in FSM pupil numbers between 2017 and 2018"]
[null,null,null,"DFE Determined Data",null,null,null,null,null,{"$f":"IF(H21=\"g\",\"\",(VLOOKUP($F13+3300000,'DFE Notification 18-19'!B:M,6,0)))","v":45},{"$f":"IF($H$21=\"g\",\"\",(VLOOKUP($F13+3300000,'DFE Notification 18-19'!$B:$M,7,0)))","v":66},{"$f":"IF($H$21=\"g\",\"\",(VLOOKUP($F13+3300000,'DFE Notification 18-19'!$B:$M,8,0)))","v":21}]
[null,null,null,"DFE Determined Data Growing Schools **",null,null,null,{"$f":"IFERROR(VLOOKUP(DFES!$E$1+3300000,'DFE Notification 18-19'!$B$2:$N$228,13,FALSE),\"\")","v":0},null,{"$f":"IF($H21=\"g\",(VLOOKUP($F13+3300000,'DFE Notification 18-19'!$B:$M,9,FALSE)),\"\")","v":""},{"$f":"IF($H21=\"g\",(VLOOKUP($F13+3300000,'DFE Notification 18-19'!$B:$M,10,FALSE)),\"\")","v":""},{"$f":"IF($H21=\"g\",(VLOOKUP($F13+3300000,'DFE Notification 18-19'!$B:$M,11,FALSE)),\"\")","v":""}]
[null,null,null,null,null,null,null,null,null,null,"Rate per FSM *",440]
[]
[null,null,null,"Total School Budget Share - 2018/19 Free School Meals Supplementary Grant",null,null,null,null,null,null,null,{"$f":"VLOOKUP($F13+3300000,'DFE Notification 18-19'!B:M,12,0)","v":2640}]
[]
[]
[null,null,null,"* The rate of £440 is only applied to positive changes in FSM pupil numbers. Reductions in FSM numbers receive no funding."]
[]
[]
[]
[null,null,null,"** Allocations for growing schools (those that are adding year groups) are based on the average FSM numbers per year group as set up in the published Free school meals supplementary grant guidance."]
[]
[null,null,null,"NOTES:"]
[null,null,null,"* Cheque Book Schools will receive a Payment for the above amount."]
[null,null,null,"* Non Cheque Schools should ensure the allocation is entered onto their School Financial System with an "]
[null,null,null,"  appropriate journal entry, in the 2018/19 financial year."]
[]
[null,null,null,"The FSM supplementary grant provides funding for schools to help them meet the costs of providing extra free school meals, due to the roll out of universal credit, before the lagged funding system catches up."]
[null,null,null,"Further information about the 2018/19 Free School Meals Supplementary Grant is available from the DfE website here:"]
[null,null,null,"https://www.gov.uk/government/publications/free-school-meals-supplementary-grant-2018-to-2019"]
[]
[null,null,null,"N.B For the FSM Supplementary Grant, the DfE have used the FSM factor value in the national"]
[null,null,null,"funding formula (NFF) of £440 per pupil as schools are expected to pay for free school"]
[null,null,null,"meals through their core funding, which is allocated to local authorities through the NFF."]
[]
[null,null,null,"For all other enquires please e-mail:",null,null,"fairfunding@birmingham.gov.uk"]

{"sheet":"DFES","index":3,"n_rows":439,"n_cols":6,"rows_kept":439,"cut":false,"hidden":true,"merged":[]}
[null,null,null,null,2183,{"$f":"IF(ISNA(VLOOKUP($E$1,$A$10:$K$438,2,0)),0,VLOOKUP($E$1,$A$10:$K$438,2,0))","v":"ST BENEDICT'S I NC"}]
[]
[]
[]
[]
[]
[null,null,"2018-2019FSM Supp"]
[]
[null,null,"ALLOCATIONS"]
[1000,"SELLY OAK Nrsy ",{"$f":"IFERROR(VLOOKUP(A10+3300000,'DFE Notification 18-19'!B:M,12,0),0)","v":0}]
[1001,"BORDESLEY GREEN Nrsy ",{"$f":"IFERROR(VLOOKUP(A11+3300000,'DFE Notification 18-19'!B:M,12,0),0)","v":0}]
[1002,"BREARLEY ST Nrsy ",{"$f":"IFERROR(VLOOKUP(A12+3300000,'DFE Notification 18-19'!B:M,12,0),0)","v":0}]
[1006,"GARRETTS GREEN Nrsy ",{"$f":"IFERROR(VLOOKUP(A13+3300000,'DFE Notification 18-19'!B:M,12,0),0)","v":0}]
[1008,"PERRY BEECHES Nrsy ",{"$f":"IFERROR(VLOOKUP(A14+3300000,'DFE Notification 18-19'!B:M,12,0),0)","v":0}]
[1009,"ST THOMAS Nrsy ",{"$f":"IFERROR(VLOOKUP(A15+3300000,'DFE Notification 18-19'!B:M,12,0),0)","v":0}]
[1010,"HIGHFIELD Nrsy ",{"$f":"IFERROR(VLOOKUP(A16+3300000,'DFE Notification 18-19'!B:M,12,0),0)","v":0}]
[1012,"MARSH HILL Nrsy ",{"$f":"IFERROR(VLOOKUP(A17+3300000,'DFE Notification 18-19'!B:M,12,0),0)","v":0}]
[1014,"WEST HEATH Nrsy ",{"$f":"IFERROR(VLOOKUP(A18+3300000,'DFE Notification 18-19'!B:M,12,0),0)","v":0}]
[1015,"GOODWAY Nrsy ",{"$f":"IFERROR(VLOOKUP(A19+3300000,'DFE Notification 18-19'!B:M,12,0),0)","v":0}]
[1016,"KINGS NORTON Nrsy ",{"$f":"IFERROR(VLOOKUP(A20+3300000,'DFE Notification 18-19'!B:M,12,0),0)","v":0}]
[1017,"ALLENS CROFT Nrsy ",{"$f":"IFERROR(VLOOKUP(A21+3300000,'DFE Notification 18-19'!B:M,12,0),0)","v":0}]
[1018,"RUBERY Nrsy ",{"$f":"IFERROR(VLOOKUP(A22+3300000,'DFE Notification 18-19'!B:M,12,0),0)","v":0}]
[1019,"WASHWOOD HEATH Nrsy ",{"$f":"IFERROR(VLOOKUP(A23+3300000,'DFE Notification 18-19'!B:M,12,0),0)","v":0}]
[1020,"WEOLEY CASTLE Nrsy ",{"$f":"IFERROR(VLOOKUP(A24+3300000,'DFE Notification 18-19'!B:M,12,0),0)","v":0}]
[1021,"HIGHTERS HEATH Nrsy ",{"$f":"IFERROR(VLOOKUP(A25+3300000,'DFE Notification 18-19'!B:M,12,0),0)","v":0}]
[1022,"GRACELANDS Nrsy ",{"$f":"IFERROR(VLOOKUP(A26+3300000,'DFE Notification 18-19'!B:M,12,0),0)","v":0}]
[1023,"JAKEMAN Nrsy ",{"$f":"IFERROR(VLOOKUP(A27+3300000,'DFE Notification 18-19'!B:M,12,0),0)","v":0}]
[1024,"LILLIAN DE LISSA Nrsy ",{"$f":"IFERROR(VLOOKUP(A28+3300000,'DFE Notification 18-19'!B:M,12,0),0)","v":0}]
[1025,"BLOOMSBURY Nrsy ",{"$f":"IFERROR(VLOOKUP(A29+3300000,'DFE Notification 18-19'!B:M,12,0),0)","v":0}]
[1026,"FEATHERSTONE Nrsy ",{"$f":"IFERROR(VLOOKUP(A30+3300000,'DFE Notification 18-19'!B:M,12,0),0)","v":0}]
[1027,"ADDERLEY Nrsy ",{"$f":"IFERROR(VLOOKUP(A31+3300000,'DFE Notification 18-19'!B:M,12,0),0)","v":0}]
[1028,"NEWTOWN Nrsy ",{"$f":"IFERROR(VLOOKUP(A32+3300000,'DFE Notification 18-19'!B:M,12,0),0)","v":0}]
[1038,"SHENLEY FIELDS Nrsy ",{"$f":"IFERROR(VLOOKUP(A33+3300000,'DFE Notification 18-19'!B:M,12,0),0)","v":0}]
[1048,"CASTLE VALE Nrsy ",{"$f":"IFERROR(VLOOKUP(A34+3300000,'DFE Notification 18-19'!B:M,12,0),0)","v":0}]
[1049,"OSBORNE Nrsy ",{"$f":"IFERROR(VLOOKUP(A35+3300000,'DFE Notification 18-19'!B:M,12,0),0)","v":0}]
[1802,"EDITH CADBURY Nrsy ",{"$f":"IFERROR(VLOOKUP(A36+3300000,'DFE Notification 18-19'!B:M,12,0),0)","v":0}]
[1100,"City of Birmingham",{"$f":"IFERROR(VLOOKUP(A37+3300000,'DFE Notification 18-19'!B:M,12,0),0)","v":25960}]
[2002,"BORDESLEY VILLAGE JI NC",{"$f":"IFERROR(VLOOKUP(A38+3300000,'DFE Notification 18-19'!B:M,12,0),0)","v":0}]
[2003,"PRINCE ALBERT JI NC",{"$f":"IFERROR(VLOOKUP(A39+3300000,'DFE Notification 18-19'!B:M,12,0),0)","v":0}]
[2004,"MAPLEDENE JI NC",{"$f":"IFERROR(VLOOKUP(A40+3300000,'DFE Notification 18-19'!B:M,12,0),0)","v":880}]
[2005,"KINGS HEATH JI NC",{"$f":"IFERROR(VLOOKUP(A41+3300000,'DFE Notification 18-19'!B:M,12,0),0)","v":5280}]
[2008,"SHAW HILL JI NC",{"$f":"IFERROR(VLOOKUP(A42+3300000,'DFE Notification 18-19'!B:M,12,0),0)","v":440}]
[2010,"ADDERLEY JI ",{"$f":"IFERROR(VLOOKUP(A43+3300000,'DFE Notification 18-19'!B:M,12,0),0)","v":0.01}]
[2011,"WHEELERS LANE JI NC",{"$f":"IFERROR(VLOOKUP(A44+3300000,'DFE Notification 18-19'!B:M,12,0),0)","v":17160}]
[2014,"BARFORD JI NC",{"$f":"IFERROR(VLOOKUP(A45+3300000,'DFE Notification 18-19'!B:M,12,0),0)","v":0.01}]
[2015,"JAMES WATT JI NC",{"$f":"IFERROR(VLOOKUP(A46+3300000,'DFE Notification 18-19'!B:M,12,0),0)","v":4400}]
[2016,"PERRY BEECHES J ",{"$f":"IFERROR(VLOOKUP(A47+3300000,'DFE Notification 18-19'!B:M,12,0),0)","v":5280}]
[2017,"PERRY BEECHES I ",{"$f":"IFERROR(VLOOKUP(A48+3300000,'DFE Notification 18-19'!B:M,12,0),0)","v":3960}]
[2018,"OAKS, THE JI NC",{"$f":"IFERROR(VLOOKUP(A49+3300000,'DFE Notification 18-19'!B:M,12,0),0)","v":13200}]
[2019,"WEST HEATH JI ",{"$f":"IFERROR(VLOOKUP(A50+3300000,'DFE Notification 18-19'!B:M,12,0),0)","v":0.01}]
[2020,"ACOCKS GREEN ACADEMY",{"$f":"IFERROR(VLOOKUP(A51+3300000,'DFE Notification 18-19'!B:M,12,0),0)","v":0}]
[2021,"PAGANEL JI NC",{"$f":"IFERROR(VLOOKUP(A52+3300000,'DFE Notification 18-19'!B:M,12,0),0)","v":3080}]
[2024,"BIRCHES GREEN J ",{"$f":"IFERROR(VLOOKUP(A53+3300000,'DFE Notification 18-19'!B:M,12,0),0)","v":880}]
[2025,"BIRCHES GREEN I NC",{"$f":"IFERROR(VLOOKUP(A54+3300000,'DFE Notification 18-19'!B:M,12,0),0)","v":880}]
[2026,"BANNERS GATE PRIMARY SCHOOL JI NC",{"$f":"IFERROR(VLOOKUP(A55+3300000,'DFE Notification 18-19'!B:M,12,0),0)","v":0.01}]
[2030,"BORDESLEY GREEN JI NC",{"$f":"IFERROR(VLOOKUP(A56+3300000,'DFE Notification 18-19'!B:M,12,0),0)","v":8360}]
[2034,"BROOKFIELDS JI NC",{"$f":"IFERROR(VLOOKUP(A57+3300000,'DFE Notification 18-19'!B:M,12,0),0)","v":0}]
[2035,"BROWNMEAD JI ",{"$f":"IFERROR(VLOOKUP(A58+3300000,'DFE Notification 18-19'!B:M,12,0),0)","v":0}]
[2036,"ERDINGTON HALL ACADEMY",{"$f":"IFERROR(VLOOKUP(A59+3300000,'DFE Notification 18-19'!B:M,12,0),0)","v":0}]
[2037,"SLADE ACADEMY",{"$f":"IFERROR(VLOOKUP(A60+3300000,'DFE Notification 18-19'!B:M,12,0),0)","v":0}]
[2038,"NANSEN ACADEMY",{"$f":"IFERROR(VLOOKUP(A61+3300000,'DFE Notification 18-19'!B:M,12,0),0)","v":0}]
[2039,"CANTERBURY CROSS JI NC",{"$f":"IFERROR(VLOOKUP(A62+3300000,'DFE Notification 18-19'!B:M,12,0),0)","v":0}]
[2040,"CHERRY ORCHARD JI NC",{"$f":"IFERROR(VLOOKUP(A63+3300000,'DFE Notification 18-19'!B:M,12,0),0)","v":0.01}]
[2041,"ARK ROSE ACADEMY",{"$f":"IFERROR(VLOOKUP(A64+3300000,'DFE Notification 18-19'!B:M,12,0),0)","v":0}]
[2047,"CHILWELL CROFT ACADEMY",{"$f":"IFERROR(VLOOKUP(A65+3300000,'DFE Notification 18-19'!B:M,12,0),0)","v":0}]
[2048,"NECHELLS ACADEMY",{"$f":"IFERROR(VLOOKUP(A66+3300000,'DFE Notification 18-19'!B:M,12,0),0)","v":0}]
[2051,"COLMERS FARM J ",{"$f":"IFERROR(VLOOKUP(A67+3300000,'DFE Notification 18-19'!B:M,12,0),0)","v":0}]
[2052,"COLMERS FARM I ",{"$f":"IFERROR(VLOOKUP(A68+3300000,'DFE Notification 18-19'!B:M,12,0),0)","v":0.01}]
[2053,"COLMORE J ",{"$f":"IFERROR(VLOOKUP(A69+3300000,'DFE Notification 18-19'!B:M,12,0),0)","v":1760}]
[2054,"COLMORE I NC",{"$f":"IFERROR(VLOOKUP(A70+3300000,'DFE Notification 18-19'!B:M,12,0),0)","v":3960}]
[2055,"COTTERIDGE JI NC",{"$f":"IFERROR(VLOOKUP(A71+3300000,'DFE Notification 18-19'!B:M,12,0),0)","v":18920}]
[2056,"ARK TINDAL ACADEMY",{"$f":"IFERROR(VLOOKUP(A72+3300000,'DFE Notification 18-19'!B:M,12,0),0)","v":0}]
[2057,"PERCY SHURMER ACADEMY",{"$f":"IFERROR(VLOOKUP(A73+3300000,'DFE Notification 18-19'!B:M,12,0),0)","v":0}]
[2058,"SHIRESTONE ACADEMY.",{"$f":"IFERROR(VLOOKUP(A74+3300000,'DFE Notification 18-19'!B:M,12,0),0)","v":0}]
[2059,"ST CLEMENT'S ACADEMY",{"$f":"IFERROR(VLOOKUP(A75+3300000,'DFE Notification 18-19'!B:M,12,0),0)","v":0}]
[2060,"CROMWELL JI NC",{"$f":"IFERROR(VLOOKUP(A76+3300000,'DFE Notification 18-19'!B:M,12,0),0)","v":0}]
[2061,"ST MICHAEL'S CE (B21) ACADEMY",{"$f":"IFERROR(VLOOKUP(A77+3300000,'DFE Notification 18-19'!B:M,12,0),0)","v":0}]
[2062,"ANDERTON PARK JI NC",{"$f":"IFERROR(VLOOKUP(A78+3300000,'DFE Notification 18-19'!B:M,12,0),0)","v":7040}]
[2063,"REGENTS PARK JI NC",{"$f":"IFERROR(VLOOKUP(A79+3300000,'DFE Notification 18-19'!B:M,12,0),0)","v":880}]
[2064,"OAKLANDS ACADEMY",{"$f":"IFERROR(VLOOKUP(A80+3300000,'DFE Notification 18-19'!B:M,12,0),0)","v":0}]
[2065,"DORRINGTON ACADEMY",{"$f":"IFERROR(VLOOKUP(A81+3300000,'DFE Notification 18-19'!B:M,12,0),0)","v":0}]
[2067,"SUMMERFIELD JI NC",{"$f":"IFERROR(VLOOKUP(A82+3300000,'DFE Notification 18-19'!B:M,12,0),0)","v":5280}]
[2068,"WARREN FARM ACADEMY",{"$f":"IFERROR(VLOOKUP(A83+3300000,'DFE Notification 18-19'!B:M,12,0),0)","v":0}]
[2070,"MONTGOMERY ACADEMY",{"$f":"IFERROR(VLOOKUP(A84+3300000,'DFE Notification 18-19'!B:M,12,0),0)","v":0}]
[2071,"ST JOHN'S CE (B16) ACADEMY",{"$f":"IFERROR(VLOOKUP(A85+3300000,'DFE Notification 18-19'!B:M,12,0),0)","v":0}]
[2072,"BILLESLEY ACADEMY",{"$f":"IFERROR(VLOOKUP(A86+3300000,'DFE Notification 18-19'!B:M,12,0),0)","v":0}]
[2073,"KINGS RISE ACADEMY",{"$f":"IFERROR(VLOOKUP(A87+3300000,'DFE Notification 18-19'!B:M,12,0),0)","v":0}]
[2075,"MANSFIELD GREEN ACADEMY",{"$f":"IFERROR(VLOOKUP(A88+3300000,'DFE Notification 18-19'!B:M,12,0),0)","v":0}]
[2078,"MOOR GREEN ACADEMY",{"$f":"IFERROR(VLOOKUP(A89+3300000,'DFE Notification 18-19'!B:M,12,0),0)","v":0}]
[2079,"GEORGE DIXON JI ",{"$f":"IFERROR(VLOOKUP(A90+3300000,'DFE Notification 18-19'!B:M,12,0),0)","v":0.01}]
[2080,"REASIDE ACADEMY",{"$f":"IFERROR(VLOOKUP(A91+3300000,'DFE Notification 18-19'!B:M,12,0),0)","v":0}]
[2081,"GILBERTSTONE JI NC",{"$f":"IFERROR(VLOOKUP(A92+3300000,'DFE Notification 18-19'!B:M,12,0),0)","v":7480}]
[2082,"CONWAY JI NC",{"$f":"IFERROR(VLOOKUP(A93+3300000,'DFE Notification 18-19'!B:M,12,0),0)","v":0}]
[2085,"GREENHOLM ACADEMY",{"$f":"IFERROR(VLOOKUP(A94+3300000,'DFE Notification 18-19'!B:M,12,0),0)","v":0}]
[2086,"GREET JI NC",{"$f":"IFERROR(VLOOKUP(A95+3300000,'DFE Notification 18-19'!B:M,12,0),0)","v":0}]
[2087,"GRENDON JI NC",{"$f":"IFERROR(VLOOKUP(A96+3300000,'DFE Notification 18-19'!B:M,12,0),0)","v":6600}]
[2091,"GUNTER JI NC",{"$f":"IFERROR(VLOOKUP(A97+3300000,'DFE Notification 18-19'!B:M,12,0),0)","v":0.01}]
[2092,"HALL GREEN J ",{"$f":"IFERROR(VLOOKUP(A98+3300000,'DFE Notification 18-19'!B:M,12,0),0)","v":0.01}]
[2093,"HALL GREEN I NC",{"$f":"IFERROR(VLOOKUP(A99+3300000,'DFE Notification 18-19'!B:M,12,0),0)","v":2200}]
[2096,"LEA FOREST ACADEMY",{"$f":"IFERROR(VLOOKUP(A100+3300000,'DFE Notification 18-19'!B:M,12,0),0)","v":0}]
[2097,"STORY WOOD SCHOOL AND CHILDREN'S CENTRE  JI NC",{"$f":"IFERROR(VLOOKUP(A101+3300000,'DFE Notification 18-19'!B:M,12,0),0)","v":440}]
[2098,"TAME VALLEY ACADEMY",{"$f":"IFERROR(VLOOKUP(A102+3300000,'DFE Notification 18-19'!B:M,12,0),0)","v":0}]
[2099,"HAWTHORN JI ",{"$f":"IFERROR(VLOOKUP(A103+3300000,'DFE Notification 18-19'!B:M,12,0),0)","v":8360}]
[2100,"Merritts Brook E-ACT Primary Academy NC",{"$f":"IFERROR(VLOOKUP(A104+3300000,'DFE Notification 18-19'!B:M,12,0),0)","v":0}]
[2101,"HIGHFIELD JI ",{"$f":"IFERROR(VLOOKUP(A105+3300000,'DFE Notification 18-19'!B:M,12,0),0)","v":0}]
[2102,"BLAKENHALE I ACAD",{"$f":"IFERROR(VLOOKUP(A106+3300000,'DFE Notification 18-19'!B:M,12,0),0)","v":0}]
[2103,"OASIS ACADEMY SHORT HEATH",{"$f":"IFERROR(VLOOKUP(A107+3300000,'DFE Notification 18-19'!B:M,12,0),0)","v":0}]
[2104,"ST GEORGE'S CE (B16) ACADEMY",{"$f":"IFERROR(VLOOKUP(A108+3300000,'DFE Notification 18-19'!B:M,12,0),0)","v":0}]
[2105,"WOODVIEW ACADEMY",{"$f":"IFERROR(VLOOKUP(A109+3300000,'DFE Notification 18-19'!B:M,12,0),0)","v":0}]
[2107,"BLAKENHALE ACAD J ",{"$f":"IFERROR(VLOOKUP(A110+3300000,'DFE Notification 18-19'!B:M,12,0),0)","v":0}]
[2108,"WARD END JI NC",{"$f":"IFERROR(VLOOKUP(A111+3300000,'DFE Notification 18-19'!B:M,12,0),0)","v":1320}]
[2109,"FOUR DWELLINGS ACADEMY",{"$f":"IFERROR(VLOOKUP(A112+3300000,'DFE Notification 18-19'!B:M,12,0),0)","v":0}]
[2110,"HOBMOOR ACADEMY",{"$f":"IFERROR(VLOOKUP(A113+3300000,'DFE Notification 18-19'!B:M,12,0),0)","v":0}]
[2111,"JERVOISE JI NC",{"$f":"IFERROR(VLOOKUP(A114+3300000,'DFE Notification 18-19'!B:M,12,0),0)","v":0}]
[2115,"KINGSLAND JI NC",{"$f":"IFERROR(VLOOKUP(A115+3300000,'DFE Notification 18-19'!B:M,12,0),0)","v":0.01}]
[2117,"MATTHEW BOULTON ACADEMY",{"$f":"IFERROR(VLOOKUP(A116+3300000,'DFE Notification 18-19'!B:M,12,0),0)","v":0}]
[2118,"KINGS NORTON JI ",{"$f":"IFERROR(VLOOKUP(A117+3300000,'DFE Notification 18-19'!B:M,12,0),0)","v":440}]
[2119,"LAKEY LANE JI NC",{"$f":"IFERROR(VLOOKUP(A118+3300000,'DFE Notification 18-19'!B:M,12,0),0)","v":11000}]
[2120,"ST GEORGE'S CE (B19) ACADEMY",{"$f":"IFERROR(VLOOKUP(A119+3300000,'DFE Notification 18-19'!B:M,12,0),0)","v":0}]
[2121,"HAWKESLEY CE ACADEMY",{"$f":"IFERROR(VLOOKUP(A120+3300000,'DFE Notification 18-19'!B:M,12,0),0)","v":0}]
[2122,"YARNFIELD ACADEMY",{"$f":"IFERROR(VLOOKUP(A121+3300000,'DFE Notification 18-19'!B:M,12,0),0)","v":0}]
[2126,"TIVERTON ACADEMY",{"$f":"IFERROR(VLOOKUP(A122+3300000,'DFE Notification 18-19'!B:M,12,0),0)","v":0}]
[2127,"LOZELLS JI NC",{"$f":"IFERROR(VLOOKUP(A123+3300000,'DFE Notification 18-19'!B:M,12,0),0)","v":0.01}]
[2128,"LYNDON GREEN J ",{"$f":"IFERROR(VLOOKUP(A124+3300000,'DFE Notification 18-19'!B:M,12,0),0)","v":6600}]
[2129,"LYNDON GREEN I ",{"$f":"IFERROR(VLOOKUP(A125+3300000,'DFE Notification 18-19'!B:M,12,0),0)","v":5280}]
[2132,"MARLBOROUGH I NC",{"$f":"IFERROR(VLOOKUP(A126+3300000,'DFE Notification 18-19'!B:M,12,0),0)","v":0}]
[2133,"MARSH HILL JI ",{"$f":"IFERROR(VLOOKUP(A127+3300000,'DFE Notification 18-19'!B:M,12,0),0)","v":5280}]
[2134,"CITY ROAD ACADEMY",{"$f":"IFERROR(VLOOKUP(A128+3300000,'DFE Notification 18-19'!B:M,12,0),0)","v":0}]
[2136,"WOODHOUSE ACADEMY",{"$f":"IFERROR(VLOOKUP(A129+3300000,'DFE Notification 18-19'!B:M,12,0),0)","v":0}]
[2138,"GRESTONE ACADEMY",{"$f":"IFERROR(VLOOKUP(A130+3300000,'DFE Notification 18-19'!B:M,12,0),0)","v":0}]
[2142,"NELSON JI NC",{"$f":"IFERROR(VLOOKUP(A131+3300000,'DFE Notification 18-19'!B:M,12,0),0)","v":0.01}]
[2149,"PAGET JI NC",{"$f":"IFERROR(VLOOKUP(A132+3300000,'DFE Notification 18-19'!B:M,12,0),0)","v":0.01}]
[2150,"PARK HILL JI NC",{"$f":"IFERROR(VLOOKUP(A133+3300000,'DFE Notification 18-19'!B:M,12,0),0)","v":4840}]
[2153,"ALLENS CROFT JI ",{"$f":"IFERROR(VLOOKUP(A134+3300000,'DFE Notification 18-19'!B:M,12,0),0)","v":8800}]
[2155,"PRINCETHORPE J ",{"$f":"IFERROR(VLOOKUP(A135+3300000,'DFE Notification 18-19'!B:M,12,0),0)","v":3080}]
[2156,"PRINCETHORPE I NC",{"$f":"IFERROR(VLOOKUP(A136+3300000,'DFE Notification 18-19'!B:M,12,0),0)","v":0}]
[2157,"RADDLEBARN JI NC",{"$f":"IFERROR(VLOOKUP(A137+3300000,'DFE Notification 18-19'!B:M,12,0),0)","v":440}]
[2159,"REDHILL JI NC",{"$f":"IFERROR(VLOOKUP(A138+3300000,'DFE Notification 18-19'!B:M,12,0),0)","v":0.01}]
[2160,"REDNAL HILL J ",{"$f":"IFERROR(VLOOKUP(A139+3300000,'DFE Notification 18-19'!B:M,12,0),0)","v":7480}]
[2161,"REDNAL HILL I NC",{"$f":"IFERROR(VLOOKUP(A140+3300000,'DFE Notification 18-19'!B:M,12,0),0)","v":12320}]
[2169,"SEVERNE JI NC",{"$f":"IFERROR(VLOOKUP(A141+3300000,'DFE Notification 18-19'!B:M,12,0),0)","v":5280}]
[2174,"SLADEFIELD I ",{"$f":"IFERROR(VLOOKUP(A142+3300000,'DFE Notification 18-19'!B:M,12,0),0)","v":15840}]
[2176,"SOMERVILLE JI NC",{"$f":"IFERROR(VLOOKUP(A143+3300000,'DFE Notification 18-19'!B:M,12,0),0)","v":10120}]
[2178,"STANVILLE JI NC",{"$f":"IFERROR(VLOOKUP(A144+3300000,'DFE Notification 18-19'!B:M,12,0),0)","v":3080}]
[2179,"STARBANK JI NC",{"$f":"IFERROR(VLOOKUP(A145+3300000,'DFE Notification 18-19'!B:M,12,0),0)","v":0.01}]
[2180,"YEW TREE JI NC",{"$f":"IFERROR(VLOOKUP(A146+3300000,'DFE Notification 18-19'!B:M,12,0),0)","v":0}]
[2182,"OLDKNOW ACADEMY",{"$f":"IFERROR(VLOOKUP(A147+3300000,'DFE Notification 18-19'!B:M,12,0),0)","v":0}]
[2183,"ST BENEDICT'S I NC",{"$f":"IFERROR(VLOOKUP(A148+3300000,'DFE Notification 18-19'!B:M,12,0),0)","v":2640}]
[2184,"STECHFORD JI NC",{"$f":"IFERROR(VLOOKUP(A149+3300000,'DFE Notification 18-19'!B:M,12,0),0)","v":12760}]
[2185,"COLEBOURNE JI ",{"$f":"IFERROR(VLOOKUP(A150+3300000,'DFE Notification 18-19'!B:M,12,0),0)","v":0.01}]
[2188,"STIRCHLEY JI NC",{"$f":"IFERROR(VLOOKUP(A151+3300000,'DFE Notification 18-19'!B:M,12,0),0)","v":0}]
[2189,"LADYPOOL JI NC",{"$f":"IFERROR(VLOOKUP(A152+3300000,'DFE Notification 18-19'!B:M,12,0),0)","v":0.01}]
[2190,"SUNDRIDGE JI ",{"$f":"IFERROR(VLOOKUP(A153+3300000,'DFE Notification 18-19'!B:M,12,0),0)","v":5280}]
[2191,"COURT FARM JI ",{"$f":"IFERROR(VLOOKUP(A154+3300000,'DFE Notification 18-19'!B:M,12,0),0)","v":7040}]
[2192,"THORNTON JI ",{"$f":"IFERROR(VLOOKUP(A155+3300000,'DFE Notification 18-19'!B:M,12,0),0)","v":0.01}]
[2195,"TIMBERLEY ACADEMY",{"$f":"IFERROR(VLOOKUP(A156+3300000,'DFE Notification 18-19'!B:M,12,0),0)","v":0}]
[2225,"WORLDS END J ",{"$f":"IFERROR(VLOOKUP(A157+3300000,'DFE Notification 18-19'!B:M,12,0),0)","v":4840}]
[2226,"COTTESBROOKE J ",{"$f":"IFERROR(VLOOKUP(A158+3300000,'DFE Notification 18-19'!B:M,12,0),0)","v":0}]
[2227,"YARDLEY WOOD JI NC",{"$f":"IFERROR(VLOOKUP(A159+3300000,'DFE Notification 18-19'!B:M,12,0),0)","v":9680}]
[2231,"YORKMEAD JI NC",{"$f":"IFERROR(VLOOKUP(A160+3300000,'DFE Notification 18-19'!B:M,12,0),0)","v":0.01}]
[2236,"BROADMEADOW J ",{"$f":"IFERROR(VLOOKUP(A161+3300000,'DFE Notification 18-19'!B:M,12,0),0)","v":2200}]
[2238,"BROADMEADOW I NC",{"$f":"IFERROR(VLOOKUP(A162+3300000,'DFE Notification 18-19'!B:M,12,0),0)","v":440}]
[2239,"BELLFIELD I NC",{"$f":"IFERROR(VLOOKUP(A163+3300000,'DFE Notification 18-19'!B:M,12,0),0)","v":0.01}]
[2241,"BELLFIELD J ",{"$f":"IFERROR(VLOOKUP(A164+3300000,'DFE Notification 18-19'!B:M,12,0),0)","v":11000}]
[2245,"WELSH HOUSE FARM JI NC",{"$f":"IFERROR(VLOOKUP(A165+3300000,'DFE Notification 18-19'!B:M,12,0),0)","v":0.01}]
[2246,"MEADOWS JI ",{"$f":"IFERROR(VLOOKUP(A166+3300000,'DFE Notification 18-19'!B:M,12,0),0)","v":19360}]
[2249,"THE ORCHARDS ACADEMY",{"$f":"IFERROR(VLOOKUP(A167+3300000,'DFE Notification 18-19'!B:M,12,0),0)","v":0}]
[2251,"CHILCOTE JI NC",{"$f":"IFERROR(VLOOKUP(A168+3300000,'DFE Notification 18-19'!B:M,12,0),0)","v":3520}]
[2254,"BLAKESLEY HALL JI ",{"$f":"IFERROR(VLOOKUP(A169+3300000,'DFE Notification 18-19'!B:M,12,0),0)","v":4840}]
[2263,"NORTHFIELD MANOR JI ",{"$f":"IFERROR(VLOOKUP(A170+3300000,'DFE Notification 18-19'!B:M,12,0),0)","v":0}]
[2272,"CHIVENOR JI ",{"$f":"IFERROR(VLOOKUP(A171+3300000,'DFE Notification 18-19'!B:M,12,0),0)","v":0}]
[2273,"TOPCLIFFE JI ",{"$f":"IFERROR(VLOOKUP(A172+3300000,'DFE Notification 18-19'!B:M,12,0),0)","v":0}]
[2276,"WILKES GREEN I NC",{"$f":"IFERROR(VLOOKUP(A173+3300000,'DFE Notification 18-19'!B:M,12,0),0)","v":8800}]
[2278,"WOODGATE JI ",{"$f":"IFERROR(VLOOKUP(A174+3300000,'DFE Notification 18-19'!B:M,12,0),0)","v":4400}]
[2283,"MARLBOROUGH J ",{"$f":"IFERROR(VLOOKUP(A175+3300000,'DFE Notification 18-19'!B:M,12,0),0)","v":0}]
[2284,"DEYKIN AVENUE JI ",{"$f":"IFERROR(VLOOKUP(A176+3300000,'DFE Notification 18-19'!B:M,12,0),0)","v":1760}]
[2288,"HOLLYWOOD JI ",{"$f":"IFERROR(VLOOKUP(A177+3300000,'DFE Notification 18-19'!B:M,12,0),0)","v":440}]
[2289,"COFTON JI ",{"$f":"IFERROR(VLOOKUP(A178+3300000,'DFE Notification 18-19'!B:M,12,0),0)","v":0.01}]
[2293,"WILKES GREEN J ",{"$f":"IFERROR(VLOOKUP(A179+3300000,'DFE Notification 18-19'!B:M,12,0),0)","v":880}]
[2294,"FEATHERSTONE JI ",{"$f":"IFERROR(VLOOKUP(A180+3300000,'DFE Notification 18-19'!B:M,12,0),0)","v":11000}]
[2295,"BROOKVALE ACADEMY",{"$f":"IFERROR(VLOOKUP(A181+3300000,'DFE Notification 18-19'!B:M,12,0),0)","v":0}]
[2296,"GLENMEAD JI ",{"$f":"IFERROR(VLOOKUP(A182+3300000,'DFE Notification 18-19'!B:M,12,0),0)","v":440}]
[2297,"BIRCHFIELD JI NC",{"$f":"IFERROR(VLOOKUP(A183+3300000,'DFE Notification 18-19'!B:M,12,0),0)","v":0}]
[2299,"COTTESBROOKE I NC",{"$f":"IFERROR(VLOOKUP(A184+3300000,'DFE Notification 18-19'!B:M,12,0),0)","v":0}]
[2300,"ARDEN JI NC",{"$f":"IFERROR(VLOOKUP(A185+3300000,'DFE Notification 18-19'!B:M,12,0),0)","v":0.01}]
[2305,"CHANDOS JI NC",{"$f":"IFERROR(VLOOKUP(A186+3300000,'DFE Notification 18-19'!B:M,12,0),0)","v":0}]
[2306,"WATERMILL JI ",{"$f":"IFERROR(VLOOKUP(A187+3300000,'DFE Notification 18-19'!B:M,12,0),0)","v":3520}]
[2308,"WELFORD JI NC",{"$f":"IFERROR(VLOOKUP(A188+3300000,'DFE Notification 18-19'!B:M,12,0),0)","v":6600}]
[2309,"HEATHFIELD JI NC",{"$f":"IFERROR(VLOOKUP(A189+3300000,'DFE Notification 18-19'!B:M,12,0),0)","v":0}]
[2310,"FAIRWAY ACADEMY",{"$f":"IFERROR(VLOOKUP(A190+3300000,'DFE Notification 18-19'!B:M,12,0),0)","v":0}]
[2312,"CHAD VALE JI ",{"$f":"IFERROR(VLOOKUP(A191+3300000,'DFE Notification 18-19'!B:M,12,0),0)","v":2200}]
[2313,"HEATH MOUNT JI ",{"$f":"IFERROR(VLOOKUP(A192+3300000,'DFE Notification 18-19'!B:M,12,0),0)","v":0.01}]
[2314,"WOODTHORPE JI ",{"$f":"IFERROR(VLOOKUP(A193+3300000,'DFE Notification 18-19'!B:M,12,0),0)","v":0.01}]
[2315,"NONSUCH JI ",{"$f":"IFERROR(VLOOKUP(A194+3300000,'DFE Notification 18-19'!B:M,12,0),0)","v":0}]
[2317,"WORLDS END I NC",{"$f":"IFERROR(VLOOKUP(A195+3300000,'DFE Notification 18-19'!B:M,12,0),0)","v":10120}]
[2321,"KITWELL JI NC",{"$f":"IFERROR(VLOOKUP(A196+3300000,'DFE Notification 18-19'!B:M,12,0),0)","v":2200}]
[2401,"BOLDMERE J ",{"$f":"IFERROR(VLOOKUP(A197+3300000,'DFE Notification 18-19'!B:M,12,0),0)","v":1760}]
[2402,"BOLDMERE I NC",{"$f":"IFERROR(VLOOKUP(A198+3300000,'DFE Notification 18-19'!B:M,12,0),0)","v":1320}]
[2406,"MINWORTH JI ",{"$f":"IFERROR(VLOOKUP(A199+3300000,'DFE Notification 18-19'!B:M,12,0),0)","v":5720}]
[2408,"TOWN J ",{"$f":"IFERROR(VLOOKUP(A200+3300000,'DFE Notification 18-19'!B:M,12,0),0)","v":0}]
[2412,"WYLDE GREEN JI ",{"$f":"IFERROR(VLOOKUP(A201+3300000,'DFE Notification 18-19'!B:M,12,0),0)","v":2640}]
[2416,"MOOR HALL JI ",{"$f":"IFERROR(VLOOKUP(A202+3300000,'DFE Notification 18-19'!B:M,12,0),0)","v":1320}]
[2420,"MANEY HILL JI ",{"$f":"IFERROR(VLOOKUP(A203+3300000,'DFE Notification 18-19'!B:M,12,0),0)","v":0.01}]
[2425,"PENNS JI ",{"$f":"IFERROR(VLOOKUP(A204+3300000,'DFE Notification 18-19'!B:M,12,0),0)","v":2640}]
[2429,"HOLLAND HOUSE I NC",{"$f":"IFERROR(VLOOKUP(A205+3300000,'DFE Notification 18-19'!B:M,12,0),0)","v":2640}]
[2434,"HILLSTONE JI NC",{"$f":"IFERROR(VLOOKUP(A206+3300000,'DFE Notification 18-19'!B:M,12,0),0)","v":0}]
[2435,"BENSON JI NC",{"$f":"IFERROR(VLOOKUP(A207+3300000,'DFE Notification 18-19'!B:M,12,0),0)","v":880}]
[2436,"OSBORNE JI ",{"$f":"IFERROR(VLOOKUP(A208+3300000,'DFE Notification 18-19'!B:M,12,0),0)","v":4840}]
[2437,"FOUNDRY JI NC",{"$f":"IFERROR(VLOOKUP(A209+3300000,'DFE Notification 18-19'!B:M,12,0),0)","v":0}]
[2438,"HIGHTERS HEATH JI ",{"$f":"IFERROR(VLOOKUP(A210+3300000,'DFE Notification 18-19'!B:M,12,0),0)","v":3960}]
[2441,"KINGSTHORNE JI NC",{"$f":"IFERROR(VLOOKUP(A211+3300000,'DFE Notification 18-19'!B:M,12,0),0)","v":40040}]
[2442,"TURVES GREEN JI ",{"$f":"IFERROR(VLOOKUP(A212+3300000,'DFE Notification 18-19'!B:M,12,0),0)","v":0}]
[2443,"ASTON TOWER JI NC",{"$f":"IFERROR(VLOOKUP(A213+3300000,'DFE Notification 18-19'!B:M,12,0),0)","v":0}]
[2445,"WOODCOCK HILL JI ",{"$f":"IFERROR(VLOOKUP(A214+3300000,'DFE Notification 18-19'!B:M,12,0),0)","v":6160}]
[2447,"OVAL, THE JI NC",{"$f":"IFERROR(VLOOKUP(A215+3300000,'DFE Notification 18-19'!B:M,12,0),0)","v":0}]
[2448,"GOSSEY LANE JI NC",{"$f":"IFERROR(VLOOKUP(A216+3300000,'DFE Notification 18-19'!B:M,12,0),0)","v":0}]
[2449,"TWICKENHAM JI NC",{"$f":"IFERROR(VLOOKUP(A217+3300000,'DFE Notification 18-19'!B:M,12,0),0)","v":0}]
[2450,"GREAT BARR ACADEMY",{"$f":"IFERROR(VLOOKUP(A218+3300000,'DFE Notification 18-19'!B:M,12,0),0)","v":0}]
[2451,"GREEN MEADOW JI ",{"$f":"IFERROR(VLOOKUP(A219+3300000,'DFE Notification 18-19'!B:M,12,0),0)","v":0}]
[2452,"PEGASUS ACADEMY",{"$f":"IFERROR(VLOOKUP(A220+3300000,'DFE Notification 18-19'!B:M,12,0),0)","v":0}]
[2453,"LEIGH JI NC",{"$f":"IFERROR(VLOOKUP(A221+3300000,'DFE Notification 18-19'!B:M,12,0),0)","v":0}]
[2454,"ELMS FARM JI NC",{"$f":"IFERROR(VLOOKUP(A222+3300000,'DFE Notification 18-19'!B:M,12,0),0)","v":1320}]
[2455,"HEATHLANDS JI NC",{"$f":"IFERROR(VLOOKUP(A223+3300000,'DFE Notification 18-19'!B:M,12,0),0)","v":0}]
[2456,"BELLS FARM JI ",{"$f":"IFERROR(VLOOKUP(A224+3300000,'DFE Notification 18-19'!B:M,12,0),0)","v":1760}]
[2457,"NELSON MANDELA JI NC",{"$f":"IFERROR(VLOOKUP(A225+3300000,'DFE Notification 18-19'!B:M,12,0),0)","v":440}]
[2458,"PARKFIELD ACADEMY",{"$f":"IFERROR(VLOOKUP(A226+3300000,'DFE Notification 18-19'!B:M,12,0),0)","v":0}]
[2460,"ROBIN HOOD ACADEMY",{"$f":"IFERROR(VLOOKUP(A227+3300000,'DFE Notification 18-19'!B:M,12,0),0)","v":0}]
[2462,"LITTLE SUTTON JI ",{"$f":"IFERROR(VLOOKUP(A228+3300000,'DFE Notification 18-19'!B:M,12,0),0)","v":0.01}]
[2463,"MERE GREEN ACADEMY",{"$f":"IFERROR(VLOOKUP(A229+3300000,'DFE Notification 18-19'!B:M,12,0),0)","v":0}]
[2464,"COPPICE JI ",{"$f":"IFERROR(VLOOKUP(A230+3300000,'DFE Notification 18-19'!B:M,12,0),0)","v":2200}]
[2465,"CALSHOT JI NC",{"$f":"IFERROR(VLOOKUP(A231+3300000,'DFE Notification 18-19'!B:M,12,0),0)","v":2200}]
[2466,"GROVE JI NC",{"$f":"IFERROR(VLOOKUP(A232+3300000,'DFE Notification 18-19'!B:M,12,0),0)","v":11000}]
[2469,"NEW HALL JI NC",{"$f":"IFERROR(VLOOKUP(A233+3300000,'DFE Notification 18-19'!B:M,12,0),0)","v":8360}]
[2471,"WESTMINSTER JI NC",{"$f":"IFERROR(VLOOKUP(A234+3300000,'DFE Notification 18-19'!B:M,12,0),0)","v":0}]
[2472,"ALSTON JI NC",{"$f":"IFERROR(VLOOKUP(A235+3300000,'DFE Notification 18-19'!B:M,12,0),0)","v":0}]
[2474,"HOLLYFIELD JI ",{"$f":"IFERROR(VLOOKUP(A236+3300000,'DFE Notification 18-19'!B:M,12,0),0)","v":6160}]
[2475,"FIRS JI NC",{"$f":"IFERROR(VLOOKUP(A237+3300000,'DFE Notification 18-19'!B:M,12,0),0)","v":0}]
[2477,"HARBORNE JI ",{"$f":"IFERROR(VLOOKUP(A238+3300000,'DFE Notification 18-19'!B:M,12,0),0)","v":0.01}]
[2478,"WHITEHOUSE COMMON JI NC",{"$f":"IFERROR(VLOOKUP(A239+3300000,'DFE Notification 18-19'!B:M,12,0),0)","v":1760}]
[2479,"ANGLESEY JI NC",{"$f":"IFERROR(VLOOKUP(A240+3300000,'DFE Notification 18-19'!B:M,12,0),0)","v":9680}]
[2480,"WYCHALL JI NC",{"$f":"IFERROR(VLOOKUP(A241+3300000,'DFE Notification 18-19'!B:M,12,0),0)","v":0}]
[2481,"ROOKERY ACADEMY",{"$f":"IFERROR(VLOOKUP(A242+3300000,'DFE Notification 18-19'!B:M,12,0),0)","v":0}]
[2482,"WATTVILLE JI NC",{"$f":"IFERROR(VLOOKUP(A243+3300000,'DFE Notification 18-19'!B:M,12,0),0)","v":14080}]
[2484,"WYNDCLIFFE JI NC",{"$f":"IFERROR(VLOOKUP(A244+3300000,'DFE Notification 18-19'!B:M,12,0),0)","v":0}]
[2485,"YENTON JI ",{"$f":"IFERROR(VLOOKUP(A245+3300000,'DFE Notification 18-19'!B:M,12,0),0)","v":13640}]
[2486,"FORESTDALE JI NC",{"$f":"IFERROR(VLOOKUP(A246+3300000,'DFE Notification 18-19'!B:M,12,0),0)","v":0.01}]
[3002,"CHRISTCHURCH CE JI NC",{"$f":"IFERROR(VLOOKUP(A247+3300000,'DFE Notification 18-19'!B:M,12,0),0)","v":0.01}]
[3003,"MOSELEY CE JI ",{"$f":"IFERROR(VLOOKUP(A248+3300000,'DFE Notification 18-19'!B:M,12,0),0)","v":440}]
[3004,"QUINTON CE JI ",{"$f":"IFERROR(VLOOKUP(A249+3300000,'DFE Notification 18-19'!B:M,12,0),0)","v":0}]
[3010,"ST JAMES CE JI ",{"$f":"IFERROR(VLOOKUP(A250+3300000,'DFE Notification 18-19'!B:M,12,0),0)","v":0.01}]
[3015,"ST MARY'S CE (B20) ACADEMY",{"$f":"IFERROR(VLOOKUP(A251+3300000,'DFE Notification 18-19'!B:M,12,0),0)","v":0}]
[3016,"ST MATTHEW'S CE JI ",{"$f":"IFERROR(VLOOKUP(A252+3300000,'DFE Notification 18-19'!B:M,12,0),0)","v":5280}]
[3019,"ST SAVIOUR'S CE JI ",{"$f":"IFERROR(VLOOKUP(A253+3300000,'DFE Notification 18-19'!B:M,12,0),0)","v":13640}]
[3025,"ST MARY'S CE (B29) JI ",{"$f":"IFERROR(VLOOKUP(A254+3300000,'DFE Notification 18-19'!B:M,12,0),0)","v":880}]
[3302,"ST BARNABAS CE JI NC",{"$f":"IFERROR(VLOOKUP(A255+3300000,'DFE Notification 18-19'!B:M,12,0),0)","v":5280}]
[3303,"HOLY TRINITY CE ACADEMY",{"$f":"IFERROR(VLOOKUP(A256+3300000,'DFE Notification 18-19'!B:M,12,0),0)","v":0}]
[3306,"ST JOHN'S CE (B11) ACADEMY",{"$f":"IFERROR(VLOOKUP(A257+3300000,'DFE Notification 18-19'!B:M,12,0),0)","v":0}]
[3307,"ST LAURENCE CE J ",{"$f":"IFERROR(VLOOKUP(A258+3300000,'DFE Notification 18-19'!B:M,12,0),0)","v":6160}]
[3310,"ST VINCENT'S RC JI NC",{"$f":"IFERROR(VLOOKUP(A259+3300000,'DFE Notification 18-19'!B:M,12,0),0)","v":4840}]
[3311,"ST MICHAEL'S CE (B32) ACADEMY",{"$f":"IFERROR(VLOOKUP(A260+3300000,'DFE Notification 18-19'!B:M,12,0),0)","v":0}]
[3314,"ST THOMAS' CE JI NC",{"$f":"IFERROR(VLOOKUP(A261+3300000,'DFE Notification 18-19'!B:M,12,0),0)","v":0}]
[3316,"GUARDIAN ANGELS RC JI ",{"$f":"IFERROR(VLOOKUP(A262+3300000,'DFE Notification 18-19'!B:M,12,0),0)","v":3520}]
[3317,"HOLY FAMILY RC JI NC",{"$f":"IFERROR(VLOOKUP(A263+3300000,'DFE Notification 18-19'!B:M,12,0),0)","v":2640}]
[3318,"ABBEY RC JI ",{"$f":"IFERROR(VLOOKUP(A264+3300000,'DFE Notification 18-19'!B:M,12,0),0)","v":3520}]
[3319,"CHRIST THE KING RC JI NC",{"$f":"IFERROR(VLOOKUP(A265+3300000,'DFE Notification 18-19'!B:M,12,0),0)","v":0.01}]
[3320,"CORPUS CHRISTI RC JI ",{"$f":"IFERROR(VLOOKUP(A266+3300000,'DFE Notification 18-19'!B:M,12,0),0)","v":7040}]
[3321,"ENGLISH MARTYRS RC JI ",{"$f":"IFERROR(VLOOKUP(A267+3300000,'DFE Notification 18-19'!B:M,12,0),0)","v":6160}]
[3322,"MARYVALE RC JI NC",{"$f":"IFERROR(VLOOKUP(A268+3300000,'DFE Notification 18-19'!B:M,12,0),0)","v":5720}]
[3323,"ORATORY RC JI NC",{"$f":"IFERROR(VLOOKUP(A269+3300000,'DFE Notification 18-19'!B:M,12,0),0)","v":0.01}]
[3325,"ROSARY RC JI NC",{"$f":"IFERROR(VLOOKUP(A270+3300000,'DFE Notification 18-19'!B:M,12,0),0)","v":0.01}]
[3327,"HOLY SOULS RC JI ",{"$f":"IFERROR(VLOOKUP(A271+3300000,'DFE Notification 18-19'!B:M,12,0),0)","v":0.01}]
[3328,"OUR LADY OF LOURDES RC JI NC",{"$f":"IFERROR(VLOOKUP(A272+3300000,'DFE Notification 18-19'!B:M,12,0),0)","v":0.01}]
[3329,"ST AUGUSTINE'S RC JI NC",{"$f":"IFERROR(VLOOKUP(A273+3300000,'DFE Notification 18-19'!B:M,12,0),0)","v":2640}]
[3330,"ST BRIGID'S RC JI NC",{"$f":"IFERROR(VLOOKUP(A274+3300000,'DFE Notification 18-19'!B:M,12,0),0)","v":0}]
[3331,"ST CATHERINE'S RC JI NC",{"$f":"IFERROR(VLOOKUP(A275+3300000,'DFE Notification 18-19'!B:M,12,0),0)","v":3520}]
[3335,"ST ANNE'S RC JI ",{"$f":"IFERROR(VLOOKUP(A276+3300000,'DFE Notification 18-19'!B:M,12,0),0)","v":6600}]
[3337,"ST CHAD'S RC JI ",{"$f":"IFERROR(VLOOKUP(A277+3300000,'DFE Notification 18-19'!B:M,12,0),0)","v":0.01}]
[3339,"ST JOSEPH'S RC (B7) JI ",{"$f":"IFERROR(VLOOKUP(A278+3300000,'DFE Notification 18-19'!B:M,12,0),0)","v":3080}]
[3342,"ST FRANCIS RC JI ",{"$f":"IFERROR(VLOOKUP(A279+3300000,'DFE Notification 18-19'!B:M,12,0),0)","v":2200}]
[3344,"ST MARY'S RC (B17) JI ",{"$f":"IFERROR(VLOOKUP(A280+3300000,'DFE Notification 18-19'!B:M,12,0),0)","v":0.01}]
[3346,"ST PATRICK'S RC JI ",{"$f":"IFERROR(VLOOKUP(A281+3300000,'DFE Notification 18-19'!B:M,12,0),0)","v":7480}]
[3347,"ST EDMUND'S RC JI NC",{"$f":"IFERROR(VLOOKUP(A282+3300000,'DFE Notification 18-19'!B:M,12,0),0)","v":2640}]
[3349,"ST THOMAS MORE'S RC JI ",{"$f":"IFERROR(VLOOKUP(A283+3300000,'DFE Notification 18-19'!B:M,12,0),0)","v":3960}]
[3350,"ST MARY & ST JOHN RC JI NC",{"$f":"IFERROR(VLOOKUP(A284+3300000,'DFE Notification 18-19'!B:M,12,0),0)","v":0}]
[3351,"OUR LADY AND ST ROSE RC JI NC",{"$f":"IFERROR(VLOOKUP(A285+3300000,'DFE Notification 18-19'!B:M,12,0),0)","v":0.01}]
[3352,"KING DAVID JI NC",{"$f":"IFERROR(VLOOKUP(A286+3300000,'DFE Notification 18-19'!B:M,12,0),0)","v":3080}]
[3353,"BOURNVILLE J ",{"$f":"IFERROR(VLOOKUP(A287+3300000,'DFE Notification 18-19'!B:M,12,0),0)","v":880}]
[3354,"BOURNVILLE I ",{"$f":"IFERROR(VLOOKUP(A288+3300000,'DFE Notification 18-19'!B:M,12,0),0)","v":2200}]
[3355,"ST EDWARD'S RC JI ",{"$f":"IFERROR(VLOOKUP(A289+3300000,'DFE Notification 18-19'!B:M,12,0),0)","v":9240}]
[3356,"ST JOSEPH'S RC (B30) JI ",{"$f":"IFERROR(VLOOKUP(A290+3300000,'DFE Notification 18-19'!B:M,12,0),0)","v":0}]
[3357,"OUR LADY'S RC JI ",{"$f":"IFERROR(VLOOKUP(A291+3300000,'DFE Notification 18-19'!B:M,12,0),0)","v":2200}]
[3358,"ST JAMES RC JI ",{"$f":"IFERROR(VLOOKUP(A292+3300000,'DFE Notification 18-19'!B:M,12,0),0)","v":0}]
[3359,"ST WILFRID'S RC JI NC",{"$f":"IFERROR(VLOOKUP(A293+3300000,'DFE Notification 18-19'!B:M,12,0),0)","v":14080}]
[3360,"ST JOHN FISHER'S RC JI ",{"$f":"IFERROR(VLOOKUP(A294+3300000,'DFE Notification 18-19'!B:M,12,0),0)","v":1760}]
[3361,"ST MARGARET MARY RC JI ",{"$f":"IFERROR(VLOOKUP(A295+3300000,'DFE Notification 18-19'!B:M,12,0),0)","v":8360}]
[3362,"ST PETER & PAUL RC JI ",{"$f":"IFERROR(VLOOKUP(A296+3300000,'DFE Notification 18-19'!B:M,12,0),0)","v":0}]
[3363,"ST DUNSTAN'S RC JI NC",{"$f":"IFERROR(VLOOKUP(A297+3300000,'DFE Notification 18-19'!B:M,12,0),0)","v":7920}]
[3365,"ST TERESA'S RC JI ",{"$f":"IFERROR(VLOOKUP(A298+3300000,'DFE Notification 18-19'!B:M,12,0),0)","v":440}]
[3366,"ST PAUL'S RC JI NC",{"$f":"IFERROR(VLOOKUP(A299+3300000,'DFE Notification 18-19'!B:M,12,0),0)","v":0}]
[3367,"ST GERARD'S RC JI NC",{"$f":"IFERROR(VLOOKUP(A300+3300000,'DFE Notification 18-19'!B:M,12,0),0)","v":0.01}]
[3371,"ST LAURENCE CE I ",{"$f":"IFERROR(VLOOKUP(A301+3300000,'DFE Notification 18-19'!B:M,12,0),0)","v":4400}]
[3372,"ST BERNADETTE'S RC JI NC",{"$f":"IFERROR(VLOOKUP(A302+3300000,'DFE Notification 18-19'!B:M,12,0),0)","v":7480}]
[3374,"OUR LADY OF FATIMA RC JI ",{"$f":"IFERROR(VLOOKUP(A303+3300000,'DFE Notification 18-19'!B:M,12,0),0)","v":0}]
[3375,"ST BERNARD'S RC JI ",{"$f":"IFERROR(VLOOKUP(A304+3300000,'DFE Notification 18-19'!B:M,12,0),0)","v":0.01}]
[3377,"ST JUDE'S RC JI ",{"$f":"IFERROR(VLOOKUP(A305+3300000,'DFE Notification 18-19'!B:M,12,0),0)","v":440}]
[3379,"ST COLUMBA'S RC JI ",{"$f":"IFERROR(VLOOKUP(A306+3300000,'DFE Notification 18-19'!B:M,12,0),0)","v":0}]
[3380,"ST AMBROSE BARLOW RC JI ",{"$f":"IFERROR(VLOOKUP(A307+3300000,'DFE Notification 18-19'!B:M,12,0),0)","v":1320}]
[3381,"ST ALBANS RC JI ",{"$f":"IFERROR(VLOOKUP(A308+3300000,'DFE Notification 18-19'!B:M,12,0),0)","v":7920}]
[3382,"ST MARTIN de PORRES RC JI ",{"$f":"IFERROR(VLOOKUP(A309+3300000,'DFE Notification 18-19'!B:M,12,0),0)","v":0.01}]
[3383,"ST MARK'S RC JI ",{"$f":"IFERROR(VLOOKUP(A310+3300000,'DFE Notification 18-19'!B:M,12,0),0)","v":0.01}]
[3385,"ST PETER'S RC JI ",{"$f":"IFERROR(VLOOKUP(A311+3300000,'DFE Notification 18-19'!B:M,12,0),0)","v":5280}]
[3386,"ST CUTHBERTS RC JI NC",{"$f":"IFERROR(VLOOKUP(A312+3300000,'DFE Notification 18-19'!B:M,12,0),0)","v":4840}]
[3401,"ST JOSEPH'S RC (B75) JI ",{"$f":"IFERROR(VLOOKUP(A313+3300000,'DFE Notification 18-19'!B:M,12,0),0)","v":0}]
[3402,"HOLY CROSS RC JI ",{"$f":"IFERROR(VLOOKUP(A314+3300000,'DFE Notification 18-19'!B:M,12,0),0)","v":0}]
[3403,"ST NICHOLAS RC JI ",{"$f":"IFERROR(VLOOKUP(A315+3300000,'DFE Notification 18-19'!B:M,12,0),0)","v":0}]
[3406,"ST CLARE'S RC JI NC",{"$f":"IFERROR(VLOOKUP(A316+3300000,'DFE Notification 18-19'!B:M,12,0),0)","v":5720}]
[3409,"SACRED HEART RC JI ",{"$f":"IFERROR(VLOOKUP(A317+3300000,'DFE Notification 18-19'!B:M,12,0),0)","v":7480}]
[3410,"ST JOHN & ST MONICA RC JI ",{"$f":"IFERROR(VLOOKUP(A318+3300000,'DFE Notification 18-19'!B:M,12,0),0)","v":0.01}]
[3411,"HOLLY HILL I NC",{"$f":"IFERROR(VLOOKUP(A319+3300000,'DFE Notification 18-19'!B:M,12,0),0)","v":4400}]
[3412,"AUDLEY JI NC",{"$f":"IFERROR(VLOOKUP(A320+3300000,'DFE Notification 18-19'!B:M,12,0),0)","v":0}]
[3413,"SPRINGFIELD JI NC",{"$f":"IFERROR(VLOOKUP(A321+3300000,'DFE Notification 18-19'!B:M,12,0),0)","v":0}]
[3421,"YARDLEY JI ",{"$f":"IFERROR(VLOOKUP(A322+3300000,'DFE Notification 18-19'!B:M,12,0),0)","v":11000}]
[3428,"ST PETER'S CE JI NC",{"$f":"IFERROR(VLOOKUP(A323+3300000,'DFE Notification 18-19'!B:M,12,0),0)","v":3960}]
[3429,"HILL WEST ACADEMY",{"$f":"IFERROR(VLOOKUP(A324+3300000,'DFE Notification 18-19'!B:M,12,0),0)","v":0}]
[3430,"HODGE HILL JI ",{"$f":"IFERROR(VLOOKUP(A325+3300000,'DFE Notification 18-19'!B:M,12,0),0)","v":0}]
[3431,"NEW OSCOTT JI NC",{"$f":"IFERROR(VLOOKUP(A326+3300000,'DFE Notification 18-19'!B:M,12,0),0)","v":6160}]
[3432,"CLIFTON JI NC",{"$f":"IFERROR(VLOOKUP(A327+3300000,'DFE Notification 18-19'!B:M,12,0),0)","v":0.01}]
[3433,"ALBERT BRADBEER JI NC",{"$f":"IFERROR(VLOOKUP(A328+3300000,'DFE Notification 18-19'!B:M,12,0),0)","v":0}]
[3435,"FOUR OAKS JI ",{"$f":"IFERROR(VLOOKUP(A329+3300000,'DFE Notification 18-19'!B:M,12,0),0)","v":880}]
[3436,"HARPER BELL PRIMARY JI NC",{"$f":"IFERROR(VLOOKUP(A330+3300000,'DFE Notification 18-19'!B:M,12,0),0)","v":0.01}]
[4001,"KINGS NORTON HIGH ACADEMY",{"$f":"IFERROR(VLOOKUP(A331+3300000,'DFE Notification 18-19'!B:M,12,0),0)","v":0}]
[4005,"FOUR DWELLINGS ACADEMY",{"$f":"IFERROR(VLOOKUP(A332+3300000,'DFE Notification 18-19'!B:M,12,0),0)","v":0}]
[4006,"GREENWOOD ACADEMY ",{"$f":"IFERROR(VLOOKUP(A333+3300000,'DFE Notification 18-19'!B:M,12,0),0)","v":0}]
[4008,"SALTLEY Sec ",{"$f":"IFERROR(VLOOKUP(A334+3300000,'DFE Notification 18-19'!B:M,12,0),0)","v":0}]
[4009,"WAVERLEY Sec (16+) ",{"$f":"IFERROR(VLOOKUP(A335+3300000,'DFE Notification 18-19'!B:M,12,0),0)","v":0}]
[4012,"HILLCREST ACADEMY",{"$f":"IFERROR(VLOOKUP(A336+3300000,'DFE Notification 18-19'!B:M,12,0),0)","v":0}]
[4013,"GOLDEN HILLOCK ACADEMY",{"$f":"IFERROR(VLOOKUP(A337+3300000,'DFE Notification 18-19'!B:M,12,0),0)","v":0}]
[4015,"HODGE HILL GIRLS Sec ",{"$f":"IFERROR(VLOOKUP(A338+3300000,'DFE Notification 18-19'!B:M,12,0),0)","v":8800}]
[4057,"LORDSWOOD BOYS ACADEMY",{"$f":"IFERROR(VLOOKUP(A339+3300000,'DFE Notification 18-19'!B:M,12,0),0)","v":0}]
[4060,"LORDSWOOD GIRLS ACADEMY",{"$f":"IFERROR(VLOOKUP(A340+3300000,'DFE Notification 18-19'!B:M,12,0),0)","v":0}]
[4063,"KINGS HEATH Sec ",{"$f":"IFERROR(VLOOKUP(A341+3300000,'DFE Notification 18-19'!B:M,12,0),0)","v":8800}]
[4084,"WASHWOOD HEATH ACADEMY (16+) ",{"$f":"IFERROR(VLOOKUP(A342+3300000,'DFE Notification 18-19'!B:M,12,0),0)","v":0}]
[4108,"BARTLEY GREEN ACADEMY",{"$f":"IFERROR(VLOOKUP(A343+3300000,'DFE Notification 18-19'!B:M,12,0),0)","v":0}]
[4109,"PERRY BEECHES ACADEMY",{"$f":"IFERROR(VLOOKUP(A344+3300000,'DFE Notification 18-19'!B:M,12,0),0)","v":0}]
[4115,"BORDESLEY GREEN GIRLS Sec (16+) ",{"$f":"IFERROR(VLOOKUP(A345+3300000,'DFE Notification 18-19'!B:M,12,0),0)","v":6160}]
[4129,"DAME ELIZABETH CADBURY Sec (16+) ",{"$f":"IFERROR(VLOOKUP(A346+3300000,'DFE Notification 18-19'!B:M,12,0),0)","v":0}]
[4173,"QUEENSBRIDGE Sec ",{"$f":"IFERROR(VLOOKUP(A347+3300000,'DFE Notification 18-19'!B:M,12,0),0)","v":4400}]
[4177,"SELLY PARK TECH COLLEGE FOR GIRLS Sec ",{"$f":"IFERROR(VLOOKUP(A348+3300000,'DFE Notification 18-19'!B:M,12,0),0)","v":9680}]
[4187,"TURVES GREEN GIRLS Sec ",{"$f":"IFERROR(VLOOKUP(A349+3300000,'DFE Notification 18-19'!B:M,12,0),0)","v":14960}]
[4188,"TURVES GREEN BOYS Sec ",{"$f":"IFERROR(VLOOKUP(A350+3300000,'DFE Notification 18-19'!B:M,12,0),0)","v":2640}]
[4193,"WHEELERS LANE Sec ",{"$f":"IFERROR(VLOOKUP(A351+3300000,'DFE Notification 18-19'!B:M,12,0),0)","v":5720}]
[4201,"HODGE HILL Sec ",{"$f":"IFERROR(VLOOKUP(A352+3300000,'DFE Notification 18-19'!B:M,12,0),0)","v":0.01}]
[4206,"STOCKLAND GREEN ACADEMY",{"$f":"IFERROR(VLOOKUP(A353+3300000,'DFE Notification 18-19'!B:M,12,0),0)","v":0}]
[4207,"HANDSWORTH WOOD GIRLS ACADEMY",{"$f":"IFERROR(VLOOKUP(A354+3300000,'DFE Notification 18-19'!B:M,12,0),0)","v":0}]
[4220,"ASTON MANOR ACADEMY",{"$f":"IFERROR(VLOOKUP(A355+3300000,'DFE Notification 18-19'!B:M,12,0),0)","v":0}]
[4223,"HOLTE Sec (16+) ",{"$f":"IFERROR(VLOOKUP(A356+3300000,'DFE Notification 18-19'!B:M,12,0),0)","v":0.01}]
[4227,"BROADWAY ACADEMY(16+) ",{"$f":"IFERROR(VLOOKUP(A357+3300000,'DFE Notification 18-19'!B:M,12,0),0)","v":0}]
[4233,"COCKSHUT HILL Sec (16+) ",{"$f":"IFERROR(VLOOKUP(A358+3300000,'DFE Notification 18-19'!B:M,12,0),0)","v":0}]
[4237,"SWANSHURST Sec (16+) ",{"$f":"IFERROR(VLOOKUP(A359+3300000,'DFE Notification 18-19'!B:M,12,0),0)","v":0.01}]
[4238,"BOURNVILLE Sec (16+) ",{"$f":"IFERROR(VLOOKUP(A360+3300000,'DFE Notification 18-19'!B:M,12,0),0)","v":0}]
[4240,"HAMSTEAD HALL ACADEMY (16+) ",{"$f":"IFERROR(VLOOKUP(A361+3300000,'DFE Notification 18-19'!B:M,12,0),0)","v":0}]
[4241,"HOLYHEAD ACADEMY",{"$f":"IFERROR(VLOOKUP(A362+3300000,'DFE Notification 18-19'!B:M,12,0),0)","v":0}]
[4244,"INTERNATIONAL SCHOOL & COMM.COLLEGE Sec (16+) ",{"$f":"IFERROR(VLOOKUP(A363+3300000,'DFE Notification 18-19'!B:M,12,0),0)","v":0}]
[4245,"MOSELEY Sec (16+) ",{"$f":"IFERROR(VLOOKUP(A364+3300000,'DFE Notification 18-19'!B:M,12,0),0)","v":8360}]
[4246,"YARDLEYS ACADEMY",{"$f":"IFERROR(VLOOKUP(A365+3300000,'DFE Notification 18-19'!B:M,12,0),0)","v":0}]
[4300,"SUTTON COLDFIELD GIRLS ACADEMY",{"$f":"IFERROR(VLOOKUP(A366+3300000,'DFE Notification 18-19'!B:M,12,0),0)","v":0}]
[4301,"JOHN WILLMOTT Sec (16+) ",{"$f":"IFERROR(VLOOKUP(A367+3300000,'DFE Notification 18-19'!B:M,12,0),0)","v":1320}]
[4307,"ARTHUR TERRY ACAD Sec (16+) ",{"$f":"IFERROR(VLOOKUP(A368+3300000,'DFE Notification 18-19'!B:M,12,0),0)","v":0}]
[4323,"PARK VIEW ACAD Sec ",{"$f":"IFERROR(VLOOKUP(A369+3300000,'DFE Notification 18-19'!B:M,12,0),0)","v":0}]
[4330,"KINGSBURY Sec ",{"$f":"IFERROR(VLOOKUP(A370+3300000,'DFE Notification 18-19'!B:M,12,0),0)","v":0}]
[4331,"PLANTSBROOK ACAD Sec (16+) ",{"$f":"IFERROR(VLOOKUP(A371+3300000,'DFE Notification 18-19'!B:M,12,0),0)","v":0}]
[4333,"BALAAM WOOD Sec ",{"$f":"IFERROR(VLOOKUP(A372+3300000,'DFE Notification 18-19'!B:M,12,0),0)","v":4840}]
[4334,"AL-HIJRAH Sec ",{"$f":"IFERROR(VLOOKUP(A373+3300000,'DFE Notification 18-19'!B:M,12,0),0)","v":10120}]
[4606,"ST PAUL'S RC GIRLS Sec (16+) ",{"$f":"IFERROR(VLOOKUP(A374+3300000,'DFE Notification 18-19'!B:M,12,0),0)","v":1760}]
[4616,"ST THOMAS AQUINAS RC Sec (16+) ",{"$f":"IFERROR(VLOOKUP(A375+3300000,'DFE Notification 18-19'!B:M,12,0),0)","v":0}]
[4625,"ST JOHN WALL RC Sec ",{"$f":"IFERROR(VLOOKUP(A376+3300000,'DFE Notification 18-19'!B:M,12,0),0)","v":14520}]
[4660,"BISHOP VESEY'S ACAD Sec (16+) ",{"$f":"IFERROR(VLOOKUP(A377+3300000,'DFE Notification 18-19'!B:M,12,0),0)","v":0}]
[4661,"BISHOP WALSH RC Sec (16+) ",{"$f":"IFERROR(VLOOKUP(A378+3300000,'DFE Notification 18-19'!B:M,12,0),0)","v":0}]
[4663,"ST EDMUND CAMPION RC Sec (16+) ",{"$f":"IFERROR(VLOOKUP(A379+3300000,'DFE Notification 18-19'!B:M,12,0),0)","v":0.01}]
[4664,"HOLY TRINITY RC Sec ",{"$f":"IFERROR(VLOOKUP(A380+3300000,'DFE Notification 18-19'!B:M,12,0),0)","v":0.01}]
[4801,"CARDINAL WISEMAN RC Sec ",{"$f":"IFERROR(VLOOKUP(A381+3300000,'DFE Notification 18-19'!B:M,12,0),0)","v":0.01}]
[4804,"ARCHBISHOP ILSLEY RC Sec (16+) ",{"$f":"IFERROR(VLOOKUP(A382+3300000,'DFE Notification 18-19'!B:M,12,0),0)","v":10560}]
[5201,"DEANERY ACADEMY",{"$f":"IFERROR(VLOOKUP(A383+3300000,'DFE Notification 18-19'!B:M,12,0),0)","v":0}]
[5202,"WALMLEY J ",{"$f":"IFERROR(VLOOKUP(A384+3300000,'DFE Notification 18-19'!B:M,12,0),0)","v":1760}]
[5203,"WALMLEY I NC",{"$f":"IFERROR(VLOOKUP(A385+3300000,'DFE Notification 18-19'!B:M,12,0),0)","v":0.01}]
[5204,"MANOR PARK JI NC",{"$f":"IFERROR(VLOOKUP(A386+3300000,'DFE Notification 18-19'!B:M,12,0),0)","v":0}]
[5205,"ST FRANCIS CE JI NC",{"$f":"IFERROR(VLOOKUP(A387+3300000,'DFE Notification 18-19'!B:M,12,0),0)","v":0}]
[5400,"BAVERSTOCK ACADEMY (16+) ",{"$f":"IFERROR(VLOOKUP(A388+3300000,'DFE Notification 18-19'!B:M,12,0),0)","v":0}]
[5401,"SMALL HEATH Sec (16+) ",{"$f":"IFERROR(VLOOKUP(A389+3300000,'DFE Notification 18-19'!B:M,12,0),0)","v":0}]
[5402,"HANDSWORTH GRAMMAR Sec (16+) ",{"$f":"IFERROR(VLOOKUP(A390+3300000,'DFE Notification 18-19'!B:M,12,0),0)","v":0}]
[5403,"GREAT BARR Sec (16+) ",{"$f":"IFERROR(VLOOKUP(A391+3300000,'DFE Notification 18-19'!B:M,12,0),0)","v":0}]
[5404,"KING EDWARD VI HANDSWORTH ACAD Sec (16+) ",{"$f":"IFERROR(VLOOKUP(A392+3300000,'DFE Notification 18-19'!B:M,12,0),0)","v":0}]
[5405,"KING EDWARD VI FIVE WAYS ACAD Sec (16+) ",{"$f":"IFERROR(VLOOKUP(A393+3300000,'DFE Notification 18-19'!B:M,12,0),0)","v":0}]
[5406,"KING EDWARD VI CAMP HILL GIRLS ACAD Sec (16+) ",{"$f":"IFERROR(VLOOKUP(A394+3300000,'DFE Notification 18-19'!B:M,12,0),0)","v":0}]
[5407,"KING EDWARD VI CAMP HILL BOYS ACAD Sec (16+) ",{"$f":"IFERROR(VLOOKUP(A395+3300000,'DFE Notification 18-19'!B:M,12,0),0)","v":0}]
[5408,"KING EDWARD VI ASTON ACAD Sec (16+) ",{"$f":"IFERROR(VLOOKUP(A396+3300000,'DFE Notification 18-19'!B:M,12,0),0)","v":0}]
[5409,"HALL GREEN ACAD Sec ",{"$f":"IFERROR(VLOOKUP(A397+3300000,'DFE Notification 18-19'!B:M,12,0),0)","v":0}]
[5410,"FAIRFAX ACAD Sec (16+) ",{"$f":"IFERROR(VLOOKUP(A398+3300000,'DFE Notification 18-19'!B:M,12,0),0)","v":0}]
[5411,"NINESTILES ACAD",{"$f":"IFERROR(VLOOKUP(A399+3300000,'DFE Notification 18-19'!B:M,12,0),0)","v":0}]
[5412,"GEORGE DIXON ACAD Sec (16+) ",{"$f":"IFERROR(VLOOKUP(A400+3300000,'DFE Notification 18-19'!B:M,12,0),0)","v":0}]
[5413,"BISHOP CHALLONER Sec (16+) ",{"$f":"IFERROR(VLOOKUP(A401+3300000,'DFE Notification 18-19'!B:M,12,0),0)","v":8800}]
[5414,"KINGS NORTON GIRLS ACAD Sec (16+) ",{"$f":"IFERROR(VLOOKUP(A402+3300000,'DFE Notification 18-19'!B:M,12,0),0)","v":0}]
[5415,"KINGS NORTON BOYS Sec (16+) ",{"$f":"IFERROR(VLOOKUP(A403+3300000,'DFE Notification 18-19'!B:M,12,0),0)","v":5280}]
[5416,"COLMERS Sec ",{"$f":"IFERROR(VLOOKUP(A404+3300000,'DFE Notification 18-19'!B:M,12,0),0)","v":2640}]
[5949,"AL-FURQAN JI ",{"$f":"IFERROR(VLOOKUP(A405+3300000,'DFE Notification 18-19'!B:M,12,0),0)","v":0.01}]
[6905,"HEARTLANDS ACAD",{"$f":"IFERROR(VLOOKUP(A406+3300000,'DFE Notification 18-19'!B:M,12,0),0)","v":0}]
[6906,"KING EDWARD VI SHELDON HEATH ACADEMY  ",{"$f":"IFERROR(VLOOKUP(A407+3300000,'DFE Notification 18-19'!B:M,12,0),0)","v":0}]
[6907,"SHENLEY COURT ACAD",{"$f":"IFERROR(VLOOKUP(A408+3300000,'DFE Notification 18-19'!B:M,12,0),0)","v":0}]
[6908,"ST ALBAN'S CE SPEC ENGIN COLL ACAD",{"$f":"IFERROR(VLOOKUP(A409+3300000,'DFE Notification 18-19'!B:M,12,0),0)","v":0}]
[6909,"NORTH BIRMINGHAM ACADEMY  ",{"$f":"IFERROR(VLOOKUP(A410+3300000,'DFE Notification 18-19'!B:M,12,0),0)","v":0}]
[6910,"HARBORNE HILL  ACAD",{"$f":"IFERROR(VLOOKUP(A411+3300000,'DFE Notification 18-19'!B:M,12,0),0)","v":0}]
[7006,"HAMILTON Spcl",{"$f":"IFERROR(VLOOKUP(A412+3300000,'DFE Notification 18-19'!B:M,12,0),0)","v":2640}]
[7009,"VICTORIA Spcl",{"$f":"IFERROR(VLOOKUP(A413+3300000,'DFE Notification 18-19'!B:M,12,0),0)","v":0.01}]
[7012,"LONGWILL Spcl",{"$f":"IFERROR(VLOOKUP(A414+3300000,'DFE Notification 18-19'!B:M,12,0),0)","v":880}]
[7013,"CALTHORPE Spcl",{"$f":"IFERROR(VLOOKUP(A415+3300000,'DFE Notification 18-19'!B:M,12,0),0)","v":0}]
[7014,"UFFCULME Spcl",{"$f":"IFERROR(VLOOKUP(A416+3300000,'DFE Notification 18-19'!B:M,12,0),0)","v":0.01}]
[7016,"BASKERVILLE Spcl",{"$f":"IFERROR(VLOOKUP(A417+3300000,'DFE Notification 18-19'!B:M,12,0),0)","v":0.01}]
[7026,"HUNTERS HILL Spcl",{"$f":"IFERROR(VLOOKUP(A418+3300000,'DFE Notification 18-19'!B:M,12,0),0)","v":0.01}]
[7027,"HALLMOOR Spcl",{"$f":"IFERROR(VLOOKUP(A419+3300000,'DFE Notification 18-19'!B:M,12,0),0)","v":0}]
[7030,"BRAIDWOOD Spcl",{"$f":"IFERROR(VLOOKUP(A420+3300000,'DFE Notification 18-19'!B:M,12,0),0)","v":1320}]
[7031,"WILSON STUART",{"$f":"IFERROR(VLOOKUP(A421+3300000,'DFE Notification 18-19'!B:M,12,0),0)","v":0}]
[7033,"SELLY OAK Spcl",{"$f":"IFERROR(VLOOKUP(A422+3300000,'DFE Notification 18-19'!B:M,12,0),0)","v":0.01}]
[7034,"PRIESTLEY SMITH Spcl",{"$f":"IFERROR(VLOOKUP(A423+3300000,'DFE Notification 18-19'!B:M,12,0),0)","v":1760}]
[7035,"DAME ELLEN PINSENT Spcl",{"$f":"IFERROR(VLOOKUP(A424+3300000,'DFE Notification 18-19'!B:M,12,0),0)","v":3080}]
[7036,"QUEENSBURY Spcl",{"$f":"IFERROR(VLOOKUP(A425+3300000,'DFE Notification 18-19'!B:M,12,0),0)","v":0.01}]
[7037,"SKILTS Spcl",{"$f":"IFERROR(VLOOKUP(A426+3300000,'DFE Notification 18-19'!B:M,12,0),0)","v":0.01}]
[7038,"BRAYS Spcl",{"$f":"IFERROR(VLOOKUP(A427+3300000,'DFE Notification 18-19'!B:M,12,0),0)","v":0}]
[7040,"MAYFIELD Spcl",{"$f":"IFERROR(VLOOKUP(A428+3300000,'DFE Notification 18-19'!B:M,12,0),0)","v":0.01}]
[7045,"PINES Spcl",{"$f":"IFERROR(VLOOKUP(A429+3300000,'DFE Notification 18-19'!B:M,12,0),0)","v":5720}]
[7047,"SPRINGFIELD HOUSE Spcl",{"$f":"IFERROR(VLOOKUP(A430+3300000,'DFE Notification 18-19'!B:M,12,0),0)","v":0.01}]
[7049,"BRIDGE Spcl",{"$f":"IFERROR(VLOOKUP(A431+3300000,'DFE Notification 18-19'!B:M,12,0),0)","v":0}]
[7050,"FOX HOLLIES Spcl",{"$f":"IFERROR(VLOOKUP(A432+3300000,'DFE Notification 18-19'!B:M,12,0),0)","v":0.01}]
[7051,"CHERRY OAK Spcl",{"$f":"IFERROR(VLOOKUP(A433+3300000,'DFE Notification 18-19'!B:M,12,0),0)","v":0.01}]
[7052,"BEAUFORT Spcl",{"$f":"IFERROR(VLOOKUP(A434+3300000,'DFE Notification 18-19'!B:M,12,0),0)","v":0.01}]
[7053,"OSCOTT MANOR Spcl",{"$f":"IFERROR(VLOOKUP(A435+3300000,'DFE Notification 18-19'!B:M,12,0),0)","v":0.01}]
[7060,"LANGLEY Spcl",{"$f":"IFERROR(VLOOKUP(A436+3300000,'DFE Notification 18-19'!B:M,12,0),0)","v":0.01}]
[7062,"LINDSWORTH Spcl",{"$f":"IFERROR(VLOOKUP(A437+3300000,'DFE Notification 18-19'!B:M,12,0),0)","v":6600}]
[7063,"JAMES BRINDLEY Spcl",{"$f":"IFERROR(VLOOKUP(A438+3300000,'DFE Notification 18-19'!B:M,12,0),0)","v":0}]
[null,"Check",{"$f":"SUM(C10:C438)-'DFE Notification 18-19'!O52","v":908160.68000000052}]

{"sheet":"DFE Notification 18-19","index":4,"n_rows":230,"n_cols":13,"rows_kept":230,"cut":false,"hidden":true,"merged":[]}
[null,"LAEstab","School Name","Phase of Education","Oct 17 year group count","Oct 18 year group count","Oct 17  Total FSM number of pupils","Oct 18 Total FSM number of pupils","Difference in FSM pupils numbers","Oct 17 Average per year group for growing schools only","Oct 18 Average per year group for growing schools only","Difference in average per year group for growing schools only ","Allocations"]
[null,3301100,"City of Birmingham School","Not applicable",12,11,169,228,59,"","","",25960]
[null,3302004,"Mapledene Primary School","Primary",7,7,69,71,2,"","","",880]
[null,3302005,"Kings Heath Primary School","Primary",7,7,64,76,12,"","","",5280]
[null,3302008,"Shaw Hill Primary School","Primary",7,7,108,109,1,"","","",440]
[null,3302010,"Adderley Primary School","Primary",7,7,232,183,-49,"","","",0.01]
[null,3302011,"Wheelers Lane Primary School","Primary",7,7,85,124,39,"","","",17160]
[null,3302014,"Barford Primary School","Primary",7,7,121,121,0,"","","",0.01]
[null,3302015,"James Watt Primary School","Primary",7,7,128,138,10,"","","",4400]
[null,3302016,"Beeches Junior School","Primary",4,4,54,66,12,"","","",5280]
[null,3302017,"Beeches Infant School","Primary",3,3,48,57,9,"","","",3960]
[null,3302018,"The Oaks Primary School","Primary",7,7,218,248,30,"","","",13200]
[null,3302021,"Paganel Primary School","Primary",7,7,148,155,7,"","","",3080]
[null,3302024,"Birches Green Junior School","Primary",4,4,85,87,2,"","","",880]
[null,3302025,"Birches Green Infant School","Primary",3,3,83,85,2,"","","",880]
[null,3302026,"Banners Gate Primary School","Primary",7,7,106,91,-15,"","","",0.01]
[null,3302030,"Bordesley Green Primary School","Primary",7,7,128,147,19,"","","",8360]
[null,3302040,"Cherry Orchard Primary School","Primary",7,7,61,59,-2,"","","",0.01]
[null,3302052,"Colmers Farm Primary School","Primary",7,7,185,184,-1,"","","",0.01]
[null,3302053,"Colmore Junior School","Primary",4,4,46,50,4,"","","",1760]
[null,3302054,"Colmore Infant and Nursery School","Primary",4,3,27,36,9,"","","",3960]
[null,3302055,"Cotteridge Primary School","Primary",7,7,92,135,43,"","","",18920]
[null,3302062,"Anderton Park Primary School","Primary",7,7,150,166,16,"","","",7040]
[null,3302063,"Regents Park Community Primary School","Primary",7,7,172,174,2,"","","",880]
[null,3302067,"Summerfield Junior and Infant School","Primary",7,7,132,144,12,"","","",5280]
[null,3302079,"George Dixon Primary School","Primary",7,7,190,181,-9,"","","",0.01]
[null,3302081,"Gilbertstone Primary School","Primary",7,7,57,74,17,"","","",7480]
[null,3302087,"Grendon Junior and Infant School (NC)","Primary",7,7,122,137,15,"","","",6600]
[null,3302091,"Gunter Primary School","Primary",7,7,77,74,-3,"","","",0.01]
[null,3302092,"Hall Green Junior School","Primary",4,4,52,52,0,"","","",0.01]
[null,3302097,"Story Wood School","Primary",7,7,71,72,1,"","","",440]
[null,3302099,"Hawthorn Primary School","Primary",7,7,83,102,19,"","","",8360]
[null,3302108,"Ward End Primary School","Primary",7,7,216,219,3,"","","",1320]
[null,3302115,"Kingsland Primary School (NC)","Primary",7,7,125,118,-7,"","","",0.01]
[null,3302118,"Kings Norton Junior and Infant School","Primary",7,7,67,68,1,"","","",440]
[null,3302119,"Lakey Lane Junior and Infant School","Primary",7,7,78,103,25,"","","",11000]
[null,3302127,"Lozells Junior and Infant School and Nursery","Primary",7,7,136,132,-4,"","","",0.01]
[null,3302128,"Lyndon Green Junior School","Primary",4,4,44,59,15,"","","",6600]
[null,3302129,"Lyndon Green Infant School","Primary",3,3,40,52,12,"","","",5280]
[null,3302133,"Marsh Hill Primary School","Primary",7,7,109,121,12,"","","",5280]
[null,3302142,"Nelson Junior and Infant School","Primary",7,7,160,153,-7,"","","",0.01]
[null,3302149,"Paget Primary School","Primary",7,7,153,148,-5,"","","",0.01]
[null,3302150,"Park Hill Primary School","Primary",7,7,144,155,11,"","","",4840]
[null,3302153,"Allens Croft Primary School","Primary",7,7,126,146,20,"","","",8800]
[null,3302155,"Princethorpe Junior School","Primary",4,4,102,109,7,"","","",3080]
[null,3302157,"Raddlebarn Primary School","Primary",7,7,61,62,1,"","","",440]
[null,3302159,"Redhill Junior and Infant School","Primary",7,7,51,50,-1,"","","",0.01]
[null,3302160,"Rednal Hill Junior School","Primary",4,4,106,123,17,"","","",7480]
[null,3302161,"Rednal Hill Infant School","Primary",3,3,91,119,28,"","","",12320]
[null,3302169,"Severne Junior Infant and Nursery School","Primary",7,7,126,138,12,"","","",5280]
[null,3302174,"Sladefield Infant School","Primary",3,3,51,87,36,"","","",15840]
[null,3302176,"Somerville Primary (NC) School","Primary",7,7,146,169,23,"","","",10120]
[null,3302178,"Stanville Primary School","Primary",7,7,63,70,7,"","","",3080]
[null,3302179,"Starbank  School**","All through",11,12,700,670,-30,63.636363636363633,55.833333333333336,-7.8030303030302974,0.01]
[null,3302183,"St Benedict's Primary School**","Primary",3,4,45,66,21,15,16.5,1.5,2640]
[null,3302184,"Stechford Primary School","Primary",7,7,61,90,29,"","","",12760]
[null,3302185,"Colebourne Primary School","Primary",7,7,64,62,-2,"","","",0.01]
[null,3302189,"Ladypool Primary School","Primary",7,7,118,118,0,"","","",0.01]
[null,3302190,"Sundridge Primary School","Primary",7,7,60,72,12,"","","",5280]
[null,3302191,"Court Farm Primary School","Primary",7,7,90,106,16,"","","",7040]
[null,3302192,"Thornton Primary School","Primary",6,5,173,163,-10,"","","",0.01]
[null,3302225,"World's End Junior School","Primary",4,4,86,97,11,"","","",4840]
[null,3302227,"Yardley Wood Community Primary School","Primary",7,7,140,162,22,"","","",9680]
[null,3302231,"Yorkmead Junior and Infant School","Primary",7,7,85,82,-3,"","","",0.01]
[null,3302236,"Broadmeadow Junior School","Primary",4,4,73,78,5,"","","",2200]
[null,3302238,"Broadmeadow Infant School","Primary",3,3,61,62,1,"","","",440]
[null,3302239,"Bellfield Infant School (NC)","Primary",3,3,101,87,-14,"","","",0.01]
[null,3302241,"Bellfield Junior School","Primary",4,4,90,115,25,"","","",11000]
[null,3302245,"Welsh House Farm Community School and Special Needs Resources Base","Primary",7,7,112,110,-2,"","","",0.01]
[null,3302246,"The Meadows Primary School","Primary",7,7,143,187,44,"","","",19360]
[null,3302251,"Chilcote Primary School","Primary",7,7,33,41,8,"","","",3520]
[null,3302254,"Blakesley Hall Primary School","Primary",7,7,184,195,11,"","","",4840]
[null,3302276,"Wilkes Green Infant School (NC)","Primary",3,3,53,73,20,"","","",8800]
[null,3302278,"Woodgate Primary School","Primary",7,7,163,173,10,"","","",4400]
[null,3302288,"Hollywood Primary School","Primary",7,7,81,82,1,"","","",440]
[null,3302289,"Cofton Primary School","Primary",7,7,77,75,-2,"","","",0.01]
[null,3302293,"Wilkes Green Junior School","Primary",4,4,113,115,2,"","","",880]
[null,3302296,"Glenmead Primary School","Primary",7,7,80,81,1,"","","",440]
[null,3302300,"Arden Primary School","Primary",7,7,203,194,-9,"","","",0.01]
[null,3302306,"Water Mill Primary School","Primary",7,7,43,51,8,"","","",3520]
[null,3302308,"Welford Primary School","Primary",7,7,102,117,15,"","","",6600]
[null,3302312,"Chad Vale Primary School","Primary",7,7,32,37,5,"","","",2200]
[null,3302313,"Heath Mount Primary School","Primary",7,7,182,164,-18,"","","",0.01]
[null,3302314,"Woodthorpe Junior and Infant School","Primary",7,7,26,23,-3,"","","",0.01]
[null,3302317,"World's End Infant and Nursery School","Primary",3,3,56,79,23,"","","",10120]
[null,3302321,"Kitwell Primary School and Nursery Class","Primary",7,7,73,78,5,"","","",2200]
[null,3302401,"Boldmere Junior School","Primary",4,4,18,22,4,"","","",1760]
[null,3302402,"Boldmere Infant School and Nursery","Primary",3,3,15,18,3,"","","",1320]
[null,3302412,"Wylde Green Primary School","Primary",7,7,48,54,6,"","","",2640]
[null,3302416,"Moor Hall Primary School","Primary",7,7,6,9,3,"","","",1320]
[null,3302420,"Maney Hill Primary School","Primary",7,7,5,3,-2,"","","",0.01]
[null,3302425,"Penns Primary School","Primary",7,7,10,16,6,"","","",2640]
[null,3302429,"Holland House Infant School and Nursery","Primary",3,3,16,22,6,"","","",2640]
[null,3302435,"Benson Community School","Primary",7,7,194,196,2,"","","",880]
[null,3302436,"Osborne Primary School","Primary",7,7,111,122,11,"","","",4840]
[null,3302438,"Highters Heath Community School","Primary",7,7,77,86,9,"","","",3960]
[null,3302441,"Kingsthorne Primary School","Primary",7,7,154,245,91,"","","",40040]
[null,3302445,"Woodcock Hill Primary School","Primary",7,7,97,111,14,"","","",6160]
[null,3302454,"Elms Farm Community Primary School","Primary",7,7,163,166,3,"","","",1320]
[null,3302456,"Bells Farm Primary School","Primary",7,7,86,90,4,"","","",1760]
[null,3302457,"Nelson Mandela School","Primary",7,7,152,153,1,"","","",440]
[null,3302462,"Little Sutton Primary School","Primary",7,7,16,15,-1,"","","",0.01]
[null,3302464,"Coppice Primary School","Primary",7,7,18,23,5,"","","",2200]
[null,3302465,"Calshot Primary School","Primary",7,7,51,56,5,"","","",2200]
[null,3302466,"Grove School","Primary",7,7,139,164,25,"","","",11000]
[null,3302469,"New Hall Primary School","Primary",7,7,113,132,19,"","","",8360]
[null,3302474,"Hollyfield Primary School","Primary",7,7,87,101,14,"","","",6160]
[null,3302477,"Harborne Primary School","Primary",7,7,43,43,0,"","","",0.01]
[null,3302478,"Whitehouse Common Primary School","Primary",7,7,8,12,4,"","","",1760]
[null,3302479,"Anglesey Primary School","Primary",7,7,166,188,22,"","","",9680]
[null,3302482,"Wattville Primary School","Primary",7,7,113,145,32,"","","",14080]
[null,3302485,"Yenton Primary School","Primary",7,7,168,199,31,"","","",13640]
[null,3302486,"Forestdale Primary School","Primary",7,7,84,84,0,"","","",0.01]
[null,3303002,"Christ Church CofE Controlled Primary School and Nursery","Primary",7,7,68,56,-12,"","","",0.01]
[null,3303003,"Moseley Church of England Primary School","Primary",7,7,1,2,1,"","","",440]
[null,3303010,"St James Church of England Primary School, Handsworth","Primary",7,7,129,119,-10,"","","",0.01]
[null,3303016,"St Matthew's CofE Primary School","Primary",7,7,74,86,12,"","","",5280]
[null,3303019,"St Saviour's C of E Primary School","Primary",7,7,100,131,31,"","","",13640]
[null,3303025,"St Mary's Church of England Primary School","Primary",7,7,70,72,2,"","","",880]
[null,3303302,"Saint Barnabas Church of England Primary School","Primary",7,7,63,75,12,"","","",5280]
[null,3303307,"St Laurence Church Junior School","Primary",4,4,43,57,14,"","","",6160]
[null,3303310,"St Vincent's Catholic Primary School","Primary",7,7,78,89,11,"","","",4840]
[null,3303316,"Guardian Angels Catholic Primary School","Primary",7,7,42,50,8,"","","",3520]
[null,3303317,"Holy Family Catholic Primary School","Primary",7,7,45,51,6,"","","",2640]
[null,3303318,"Abbey Catholic Primary School","Primary",7,7,60,68,8,"","","",3520]
[null,3303319,"Christ The King Catholic Primary School","Primary",7,7,149,148,-1,"","","",0.01]
[null,3303320,"Corpus Christi Catholic Primary School","Primary",7,7,113,129,16,"","","",7040]
[null,3303321,"English Martyrs' Catholic Primary School","Primary",7,7,60,74,14,"","","",6160]
[null,3303322,"Maryvale Catholic Primary School","Primary",7,7,28,41,13,"","","",5720]
[null,3303323,"The Oratory Roman Catholic Primary School","Primary",7,7,54,52,-2,"","","",0.01]
[null,3303325,"The Rosary Catholic Primary School","Primary",7,7,109,102,-7,"","","",0.01]
[null,3303327,"Holy Souls Catholic Primary School","Primary",7,7,102,99,-3,"","","",0.01]
[null,3303328,"Our Lady of Lourdes Catholic Primary School (NC)","Primary",7,7,40,40,0,"","","",0.01]
[null,3303329,"St Augustine's Catholic Primary School","Primary",7,7,33,39,6,"","","",2640]
[null,3303331,"St Catherine of Siena Catholic Primary School","Primary",7,7,44,52,8,"","","",3520]
[null,3303335,"St Anne's Catholic Primary School","Primary",7,7,46,61,15,"","","",6600]
[null,3303337,"St Chad's Catholic Primary School","Primary",7,7,96,77,-19,"","","",0.01]
[null,3303339,"St Joseph's Catholic Primary School","Primary",7,7,81,88,7,"","","",3080]
[null,3303344,"St Mary's Catholic Primary School","Primary",7,7,32,32,0,"","","",0.01]
[null,3303346,"St Patrick's Catholic Primary School","Primary",7,7,43,60,17,"","","",7480]
[null,3303347,"St Edmund's Catholic Primary School","Primary",7,7,92,98,6,"","","",2640]
[null,3303349,"St Thomas More Catholic Primary School","Primary",7,7,55,64,9,"","","",3960]
[null,3303351,"Our Lady and St Rose of Lima Catholic Primary School","Primary",7,7,53,51,-2,"","","",0.01]
[null,3303352,"King David Junior and Infant School","Primary",7,7,23,30,7,"","","",3080]
[null,3303353,"Bournville Junior School","Primary",4,4,36,38,2,"","","",880]
[null,3303355,"St Edward's Catholic Primary School","Primary",7,7,57,78,21,"","","",9240]
[null,3303357,"Our Lady's Catholic Primary School","Primary",7,7,46,51,5,"","","",2200]
[null,3303359,"St Wilfrid's Catholic Junior and Infant School","Primary",7,7,94,126,32,"","","",14080]
[null,3303360,"St John Fisher Catholic Primary School","Primary",7,7,16,20,4,"","","",1760]
[null,3303361,"St Margaret Mary RC Junior and Infant School","Primary",7,7,67,86,19,"","","",8360]
[null,3303365,"St Teresa's Catholic Primary School","Primary",7,7,14,15,1,"","","",440]
[null,3303367,"St Gerard's RC Junior and Infant School","Primary",7,7,32,30,-2,"","","",0.01]
[null,3303371,"St Laurence Church Infant School","Primary",3,3,26,36,10,"","","",4400]
[null,3303372,"St Bernadette's Catholic Primary School","Primary",7,7,135,152,17,"","","",7480]
[null,3303375,"St Bernard's Catholic Primary School","Primary",7,7,75,68,-7,"","","",0.01]
[null,3303377,"St Jude's Catholic Primary School","Primary",7,7,89,90,1,"","","",440]
[null,3303380,"St Ambrose Barlow Catholic Primary School","Primary",7,7,5,8,3,"","","",1320]
[null,3303381,"St Alban's Catholic Primary School","Primary",7,7,27,45,18,"","","",7920]
[null,3303382,"St Martin de Porres Catholic Primary School","Primary",7,7,43,40,-3,"","","",0.01]
[null,3303385,"St Peter's Catholic Primary School","Primary",7,7,40,52,12,"","","",5280]
[null,3303386,"St Cuthbert's RC Junior and Infant (NC) School","Primary",7,7,62,73,11,"","","",4840]
[null,3303406,"St Clare's Catholic Primary School","Primary",7,7,113,126,13,"","","",5720]
[null,3303409,"Sacred Heart Catholic School","Primary",7,7,81,98,17,"","","",7480]
[null,3303410,"St John and Monica Catholic Primary School","Primary",7,7,73,73,0,"","","",0.01]
[null,3303411,"Holly Hill Methodist CofE Infant School","Primary",3,3,92,102,10,"","","",4400]
[null,3303421,"Yardley Primary School","Primary",7,7,163,188,25,"","","",11000]
[null,3303428,"St Peters CofE Primary School","Primary",7,7,53,62,9,"","","",3960]
[null,3303431,"New Oscott Primary School","Primary",7,7,46,60,14,"","","",6160]
[null,3303432,"Clifton Primary School","Primary",7,7,266,256,-10,"","","",0.01]
[null,3303435,"Four Oaks Primary School","Primary",7,7,15,17,2,"","","",880]
[null,3303436,"Harper Bell Seventh-day Adventist School","Primary",7,7,42,37,-5,"","","",0.01]
[null,3304015,"Hodge Hill Girls' School","Secondary",5,5,114,134,20,"","","",8800]
[null,3304063,"Kings Heath Boys","Secondary",5,5,138,158,20,"","","",8800]
[null,3304173,"Queensbridge School","Secondary",5,5,162,172,10,"","","",4400]
[null,3304187,"Turves Green Girls' School","Secondary",5,5,152,186,34,"","","",14960]
[null,3304188,"Turves Green Boys' School","Secondary",5,5,189,195,6,"","","",2640]
[null,3304193,"Wheelers Lane Technology College","Secondary",5,5,102,115,13,"","","",5720]
[null,3304201,"Hodge Hill College","Secondary",5,5,419,317,-102,"","","",0.01]
[null,3304237,"Swanshurst School","Secondary",5,5,421,404,-17,"","","",0.01]
[null,3304333,"Balaam Wood School","Secondary",5,5,167,178,11,"","","",4840]
[null,3304334,"Al-Hijrah School","All through",12,12,132,155,23,"","","",10120]
[null,3304606,"St Paul's School for Girls","Secondary",5,5,148,152,4,"","","",1760]
[null,3304625,"St John Wall Catholic School","Secondary",5,5,157,190,33,"","","",14520]
[null,3304801,"Cardinal Wiseman Catholic School","Secondary",5,5,253,239,-14,"","","",0.01]
[null,3304804,"Archbishop Ilsley Catholic School","Secondary",5,5,241,265,24,"","","",10560]
[null,3305202,"Walmley Junior School","Primary",4,4,13,17,4,"","","",1760]
[null,3305203,"Walmley Infant School","Primary",3,3,1,1,0,"","","",0.01]
[null,3305413,"Bishop Challoner Catholic College","Secondary",5,5,146,166,20,"","","",8800]
[null,3305415,"King's Norton Boys' School","Secondary",5,5,77,89,12,"","","",5280]
[null,3305949,"Al-Furqan Primary School","Primary",7,7,125,108,-17,"","","",0.01]
[null,3307006,"Hamilton School","Not applicable",7,7,60,66,6,"","","",2640]
[null,3307009,"Victoria School","Not applicable",12,12,106,94,-12,"","","",0.01]
[null,3307012,"Longwill A Primary School for Deaf Children","Not applicable",7,7,25,27,2,"","","",880]
[null,3307014,"Uffculme School","Not applicable",12,12,61,57,-4,"","","",0.01]
[null,3307016,"Baskerville School","Not applicable",5,5,37,34,-3,"","","",0.01]
[null,3307026,"Hunters Hill College","Not applicable",5,5,75,69,-6,"","","",0.01]
[null,3307030,"Braidwood School for the Deaf","Not applicable",5,5,26,29,3,"","","",1320]
[null,3307033,"Selly Oak Trust School","Not applicable",5,5,148,143,-5,"","","",0.01]
[null,3307034,"Priestley Smith School","Not applicable",12,12,20,24,4,"","","",1760]
[null,3307035,"The Dame Ellen Pinsent School","Not applicable",7,7,55,62,7,"","","",3080]
[null,3307036,"Queensbury School","Not applicable",5,5,85,81,-4,"","","",0.01]
[null,3307037,"Skilts School","Not applicable",6,6,54,45,-9,"","","",0.01]
[null,3307040,"Mayfield School","Not applicable",12,12,120,113,-7,"","","",0.01]
[null,3307045,"The Pines Special School","Not applicable",8,9,45,58,13,"","","",5720]
[null,3307047,"Springfield House Community Special School","Not applicable",6,7,54,46,-8,"","","",0.01]
[null,3307050,"Fox Hollies School and Performing Arts College","Not applicable",5,5,33,29,-4,"","","",0.01]
[null,3307051,"Cherry Oak School","Not applicable",7,7,56,41,-15,"","","",0.01]
[null,3307052,"Beaufort School","Not applicable",7,7,32,30,-2,"","","",0.01]
[null,3307053,"Oscott Manor School","Not applicable",5,5,35,27,-8,"","","",0.01]
[null,3307060,"Langley School","Not applicable",7,7,39,35,-4,"","","",0.01]
[null,3307062,"Lindsworth School","Not applicable",5,7,62,77,15,"","","",6600]
[null,3304115,"Bordesley Green Girls' School & Sixth Form","Secondary",5,5,144,158,14,null,null,null,6160]
[null,3303354,"Bournville Infant School","Primary",3,3,23,28,5,null,null,null,2200]
[null,3305416,"Colmers School and Sixth Form College","Secondary",5,5,250,256,6,null,null,null,2640]
[null,3302284,"Deykin Avenue Junior & Infant School","Primary",7,7,54,58,4,null,null,null,1760]
[null,3302294,"Featherstone Primary School","Primary",7,7,86,111,25,null,null,null,11000]
[null,3302093,"Hall Green Infants School","Primary",3,3,48,53,5,null,null,null,2200]
[null,3304223,"Holte School","Secondary",5,5,353,350,-3,null,null,null,0.01]
[null,3304664,"Holy Trinity Catholic School","Secondary",5,5,272,266,-6,null,null,null,0.01]
[null,3304301,"John Willmott School","Secondary",5,5,212,215,3,null,null,null,1320]
[null,3302406,"Minworth Junior/Infant","Primary",7,7,62,75,13,null,null,null,5720]
[null,3304245,"Moseley School","Secondary",5,5,356,375,19,null,null,null,8360]
[null,3304177,"Selly Park Technology College for Girls","Secondary",5,5,205,227,22,null,null,null,9680]
[null,3304663,"St Edmund Campion Catholic School & Sixth Form Centre","Secondary",5,5,252,229,-23,null,null,null,0.01]
[null,3303383,"St Mark's Catholic Primary School","Primary",7,7,29,28,-1,null,null,null,0.01]
[null,3303363,"St. Dunstan's Catholic Primary School","Primary",7,7,77,95,18,null,null,null,7920]
[null,3303342,"St. Francis'  Catholic Primary School","Primary",7,7,141,146,5,null,null,null,2200]
[null,3302019,"West Heath Primary School","Primary",7,7,155,153,-2,null,null,null,0.01]
[]
[null,null,null,null,null,null,null,null,null,null,null,null,{"$f":"SUM(M2:M229)","v":908160.68000000052}]

{"sheet":"DFE Notification 17-18","index":5,"n_rows":53,"n_cols":16,"rows_kept":53,"cut":false,"hidden":true,"merged":[]}
[null,null,null,"Y7 catch-up premium for financial year 2017 to 2018"]
[null,null,null,"State-funded maintained schools, academies, maintained special schools, special academies, pupil referral units (PRU) and alternative provisions(AP) academies"]
[null,null,null,"By school"]
[null,null,null,"Please note : for schools with no pupils in Year 7 in October 2016 we have used local authority proportion of eligible pupils in 2015-2016 as shown in column N. This percentage is multiplied by the 2017-2018 year 7 cohort and the 2015-16 per pupil rate of £500."]
[null,null,null,"This is the sum of all eligible pupils in the local authority in 2015-16 divided by the sum of pupils in Year 7 in the local authority in October 2016, excluding pupils in schools that did not receive funding in 2016-2016 (ie had no eligible pupils in 2015-2016)."]
[]
[null,null,null,"(1) Status as at January 2018"]
[null,null,null,"(2) number of pupils in Year 7 ( or aged 11 in Year group X) from the Oct 2016 schools census "]
[null,null,null,"(3) number of pupils in Year 7 ( or aged 11 in Year group X) from the Oct 2017 schools census  "]
[null,"LA Name","         URN",null,null," LAestab","Current Establishment Name","Type Of Establishment ","Establishment Type Group(2) ","Phase Of Education","2015-2016 Year 7 Cohort(3)","2016-2017 Year 7 Cohort(4)","% Change in Cohort between 2015 and 2016","Funding in 2015-2016","2015-2016 LA proportion","2016-2017 Funding"]
[]
[null,"LA Number","LA Name","         URN",null," LAestab","Current Establishment Name","Type Of Establishment ","Establishment Type Group(1) ","Phase of Education","2016-2017 Year 7 Cohort(2)","2017-2018 Year    7 Cohort(3)","% Change in Cohort between 2015-2016 and 2017-2018","Funding in 2016-2017","2015-2016 LA proportion of eligible pupils","2017-2018 Funding"]
[null,330,"Birmingham",103146,{"$f":"F13-3300000","v":1100},3301100,"City of Birmingham School","Pupil referral unit","LA maintained schools","Not applicable",0,3,"",0,0.20897771433103338,313]
[null,330,"Birmingham",103258,2179,3302179,"Starbank  School","Community school","LA maintained schools","All through",179,182,1.6759776536312776E-2,19646,null,19975]
[null,330,"Birmingham",103483,4015,3304015,"Hodge Hill Girls' School","Community school","LA maintained schools","Secondary",150,150,0,15500,null,15500]
[null,330,"Birmingham",103486,4063,3304063,"Kings Heath Boys","Community school","LA maintained schools","Secondary",117,121,3.4188034188034289E-2,8500,null,8791]
[null,330,"Birmingham",103493,4115,3304115,"Bordesley Green Girls' School & Sixth Form","Community school","LA maintained schools","Secondary",123,118,-4.065040650406504E-2,8860,null,8500]
[null,330,"Birmingham",103497,4173,3304173,"Queensbridge School","Foundation school","LA maintained schools","Secondary",176,176,0,17286,null,17286]
[null,330,"Birmingham",103498,4177,3304177,"Selly Park Technology College for Girls","Community school","LA maintained schools","Secondary",135,136,7.4074074074073071E-3,13696,null,13797]
[null,330,"Birmingham",103499,4187,3304187,"Turves Green Girls' School","Foundation school","LA maintained schools","Secondary",103,141,0.36893203883495151,11660,null,15962]
[null,330,"Birmingham",103500,4188,3304188,"Turves Green Boys' School","Community school","LA maintained schools","Secondary",134,136,1.4925373134328401E-2,18505,null,18781]
[null,330,"Birmingham",103501,4193,3304193,"Wheelers Lane Technology College","Community school","LA maintained schools","Secondary",128,130,1.5625E-2,11000,null,11172]
[null,330,"Birmingham",103503,4201,3304201,"Hodge Hill College","Community school","LA maintained schools","Secondary",247,248,4.0485829959513442E-3,30014,null,30136]
[null,330,"Birmingham",103509,4223,3304223,"Holte School","Community school","LA maintained schools","Secondary",192,190,-1.041666666666663E-2,20784,null,20568]
[null,330,"Birmingham",103514,4237,3304237,"Swanshurst School","Community school","LA maintained schools","Secondary",295,304,3.050847457627115E-2,22577,null,23266]
[null,330,"Birmingham",103519,4245,3304245,"Moseley School and Sixth Form","Foundation school","LA maintained schools","Secondary",229,246,7.4235807860262071E-2,27035,null,29042]
[null,330,"Birmingham",103522,4301,3304301,"John Willmott School","Community school","LA maintained schools","Secondary",184,189,2.7173913043478271E-2,8492,null,8723]
[null,330,"Birmingham",103529,4333,3304333,"Balaam Wood School","Community school","LA maintained schools","Secondary",74,68,-8.108108108108103E-2,9388,null,8627]
[null,330,"Birmingham",103531,4606,3304606,"St Paul's School for Girls","Voluntary aided school","LA maintained schools","Secondary",166,167,6.0240963855422436E-3,9338,null,9394]
[null,330,"Birmingham",103534,4625,3304625,"St John Wall Catholic School","Voluntary aided school","LA maintained schools","Secondary",120,116,-3.3333333333333326E-2,19831,null,19170]
[null,330,"Birmingham",103537,4663,3304663,"St Edmund Campion Catholic School & Sixth Form Centre","Voluntary aided school","LA maintained schools","Secondary",185,182,-1.6216216216216162E-2,25639,null,25223]
[null,330,"Birmingham",103538,4664,3304664,"Holy Trinity Catholic School","Voluntary aided school","LA maintained schools","Secondary",115,123,6.956521739130439E-2,13690,null,14642]
[null,330,"Birmingham",103539,4801,3304801,"Cardinal Wiseman Catholic School","Voluntary aided school","LA maintained schools","Secondary",119,121,1.6806722689075571E-2,10348,null,10522]
[null,330,"Birmingham",103541,4804,3304804,"Archbishop Ilsley Catholic School","Voluntary aided school","LA maintained schools","Secondary",210,223,6.1904761904761907E-2,20896,null,22190]
[null,330,"Birmingham",103560,5413,3305413,"Bishop Challoner Catholic College","Voluntary aided school","LA maintained schools","Secondary",190,193,1.5789473684210575E-2,6301,null,6400]
[null,330,"Birmingham",103562,5415,3305415,"King's Norton Boys' School","Foundation school","LA maintained schools","Secondary",121,123,1.6528925619834656E-2,10414,null,10586]
[null,330,"Birmingham",103563,5416,3305416,"Colmers School and Sixth Form College","Foundation school","LA maintained schools","Secondary",209,211,9.5693779904306719E-3,16421,null,16578]
[null,330,"Birmingham",103601,7009,3307009,"Victoria School","Community special school","Special schools","Not applicable",12,17,0.41666666666666674,6000,null,8500]
[null,330,"Birmingham",103605,7014,3307014,"Uffculme School","Community special school","Special schools","Not applicable",14,20,0.4285714285714286,6125,null,8750]
[null,330,"Birmingham",103606,7016,3307016,"Baskerville School","Community special school","Special schools","Not applicable",17,19,0.11764705882352944,7893,null,8822]
[null,330,"Birmingham",103609,7026,3307026,"Hunters Hill College","Community special school","Special schools","Not applicable",26,27,3.8461538461538547E-2,10739,null,11152]
[null,330,"Birmingham",103611,7030,3307030,"Braidwood School for the Deaf","Foundation special school","Special schools","Not applicable",5,13,1.6,2500,null,6500]
[null,330,"Birmingham",103613,7033,3307033,"Selly Oak Trust School","Foundation special school","Special schools","Not applicable",57,57,0,27164,null,27164]
[null,330,"Birmingham",103614,7034,3307034,"Priestley Smith School","Community special school","Special schools","Not applicable",6,5,-0.16666666666666663,2250,null,1875]
[null,330,"Birmingham",103615,7035,3307035,"The Dame Ellen Pinsent School","Community special school","Special schools","Not applicable",1,0,-1,104,null,0]
[null,330,"Birmingham",103616,7036,3307036,"Queensbury School","Community special school","Special schools","Not applicable",3,26,7.6666666666666661,1368,null,11856]
[null,330,"Birmingham",103619,7040,3307040,"Mayfield School","Community special school","Special schools","Not applicable",22,32,0.45454545454545459,11000,null,16000]
[null,330,"Birmingham",103622,7045,3307045,"The Pines Special School","Community special school","Special schools","Not applicable",0,13,"",0,0.20897771433103338,1358]
[null,330,"Birmingham",103625,7050,3307050,"Fox Hollies School and Performing Arts College","Community special school","Special schools","Not applicable",11,13,0.18181818181818188,4950,null,5850]
[null,330,"Birmingham",103628,7053,3307053,"Oscott Manor School","Community special school","Special schools","Not applicable",16,8,-0.5,6400,null,3200]
[null,330,"Birmingham",103632,7062,3307062,"Lindsworth School","Community special school","Special schools","Not applicable",12,18,0.5,4500,null,6750]
[null,330,"Birmingham",133306,4334,3304334,"Al-Hijrah School","Voluntary aided school","LA maintained schools","All through",58,115,0.98275862068965525,5407,null,10721]
[null,null,null,null,null,null,null,null,null,null,null,null,null,null,null,513642]

{"sheet":"DFE Notification 16-17","index":6,"n_rows":112,"n_cols":16,"rows_kept":112,"cut":false,"hidden":true,"merged":[]}
["Y7 catch-up premium for financial year 2016 to 2017"]
["State-funded maintained schools, academies, maintained special schools, special academies, pupil referral units (PRU) and alternative provisions(AP) academies"]
["By school"]
["Please note : for schools with no pupils in Year 7 in October 2015 we have used local authority proportion of eligible pupils in 2015-2016 as shown in column N.  This is the sum of all eligible pupils in the local authority in 2015-16 divided by the sum of pupils in Year 7 in the local authority in October 2015, excluding pupils in schools that did not receive funding in 2015-16 (ie had no eligible pupils in 2015-2016)."]
["Shaded cells mean not applicable"]
["(1) Number of pupils in the LA as at Oct 2015 school census who did not achieve level 4 or above in maths or reading or both in their KS2 test in 2014-2015"]
["(2) Status as at January 2017"]
["(3) number of pupils in Year 7 ( or aged 11 in Year group X) from the Oct 2015 schools census ",null,null,null,null,null,null,null,null,null,"LA Number","LA Name","15-16 LA Cohort","15-16 LA    Number of eligible pupils(1)","15-16 LA proportion"]
["(4) number of pupils in Year 7 ( or aged 11 in Year group X) from the Oct 2016 schools census  ",null,null,null,null,null,null,null,null,null,301,"Barking and Dagenham",2588,478,{"$f":"N9/M9","v":0.18469860896445131}]
[]
["LA Number","LA Name","         URN",null," LAestab","Current Establishment Name","Type Of Establishment ","Establishment Type Group(2) ","Phase Of Education","2015-2016 Year 7 Cohort(3)","2016-2017 Year 7 Cohort(4)","% Change in Cohort between 2015 and 2016","Funding in 2015-2016","2015-2016 LA proportion","2016-2017 Funding"]
[330,"Birmingham",143413,{"$f":"E12-3300000","v":2168},3302168,"Erdington Academy","Academy Sponsor Led","Academies","Secondary",113,149,{"$f":"IF(J12=0,\"\",K12/J12-1)","v":0.31858407079646023},22000,"",{"$f":"ROUND(IF(ISNUMBER(L12),M12*L12+M12,N12*K12*500),0)","v":29009}]
[330,"Birmingham",103258,{"$f":"E13-3300000","v":2179},3302179,"Starbank  School","Community School","LA maintained schools","All Through",164,179,9.1463414634146423E-2,18000,"",{"$f":"ROUND(IF(ISNUMBER(L13),M13*L13+M13,N13*K13*500),0)","v":19646},{"$f":"VLOOKUP(D13,DFES!$A:$C,2,FALSE)","v":"STARBANK JI NC"}]
[330,"Birmingham",137578,4001,3304001,"Ark Kings Academy","Academy Sponsor Led","Academies","Secondary",63,114,0.80952380952380953,9500,"",{"$f":"ROUND(IF(ISNUMBER(L14),M14*L14+M14,N14*K14*500),0)","v":17190}]
[330,"Birmingham",138200,4002,3304002,"Perry Beeches II The Free School","Free Schools","Free Schools","Secondary",113,117,3.539823008849563E-2,11500,"",11907]
[330,"Birmingham",138586,4004,3304004,"Nishkam High School","Free Schools","Free Schools","Secondary",100,118,0.17999999999999994,8000,"",9440]
[330,"Birmingham",139047,4005,3304005,"Four Dwellings Academy","Academy Sponsor Led","Academies","Secondary",82,74,-9.7560975609756073E-2,12500,"",11280]
[330,"Birmingham",139048,4006,3304006,"Greenwood Academy","Academy Sponsor Led","Academies","Secondary",164,176,7.3170731707317138E-2,21500,"",23073]
[330,"Birmingham",142219,4009,3304009,"Waverley School","Academy Converter","Academies","All Through",184,193,4.8913043478260976E-2,21000,"",22027]
[330,"Birmingham",139797,4011,3304011,"Perry Beeches III the Free School","Free Schools","Free Schools","Secondary",103,96,-6.7961165048543659E-2,11000,"",10252]
[330,"Birmingham",137346,4012,3304012,"Hillcrest School A Specialist Maths and Computing College and Sixth Form Centre","Academy Converter","Academies","Secondary",85,83,-2.352941176470591E-2,10000,"",9765]
[330,"Birmingham",140014,4013,3304013,"Ark Boulton Academy","Academy Sponsor Led","Academies","Secondary",175,179,2.2857142857142909E-2,18000,"",18411]
[330,"Birmingham",140863,4014,3304014,"The University of Birmingham School","Free Schools","Free Schools","Secondary",149,149,0,8000,"",8000]
[330,"Birmingham",103483,4015,3304015,"Hodge Hill Girls' School","Community School","LA maintained schools","Secondary",150,150,0,15500,"",15500,{"$f":"VLOOKUP(D24,DFES!$A:$C,2,FALSE)","v":"HODGE HILL GIRLS Sec "}]
[330,"Birmingham",141003,4016,3304016,"Perry Beeches IV - The Free School","Free Schools","Free Schools","Secondary",116,115,-8.6206896551723755E-3,11000,"",10905]
[330,"Birmingham",141318,4017,3304017,"Bournville School","Academy Sponsor Led","Academies","All Through",123,148,0.20325203252032531,11500,"",13837]
[330,"Birmingham",141668,4018,3304018,"Saltley Academy","Academy Sponsor Led","Academies","Secondary",209,210,4.7846889952152249E-3,27500,"",27632]
[330,"Birmingham",141752,4019,3304019,"Perry Beeches V - The All Through Family School","Free Schools","Free Schools","All Through",142,114,-0.19718309859154926,11000,"",8831]
[330,"Birmingham",141943,4020,3304020,"King Solomon International Business School","Free Schools","Free Schools","All Through",93,96,3.2258064516129004E-2,8500,"",8774]
[330,"Birmingham",141969,4021,3304021,"Eden Boys' School, Birmingham","Free Schools","Free Schools","Secondary",100,100,0,8500,"",8500]
[330,"Birmingham",142388,4022,3304022,"Cockshut Hill Technology College","Academy Sponsor Led","Academies","Secondary",193,195,1.0362694300518172E-2,29000,"",29301]
[330,"Birmingham",139157,4057,3304057,"Lordswood Boys' School","Academy Converter","Academies","Secondary",44,66,0.5,7000,"",10500]
[330,"Birmingham",136592,4060,3304060,"Lordswood Girls' School and Sixth Form Centre","Academy Converter","Academies","Secondary",131,131,0,6500,"",6500]
[330,"Birmingham",103486,4063,3304063,"Kings Heath Boys","Community School","LA maintained schools","Secondary",117,117,0,8500,"",8500,{"$f":"VLOOKUP(D34,DFES!$A:$C,2,FALSE)","v":"KINGS HEATH Sec "}]
[330,"Birmingham",139888,4084,3304084,"Washwood Heath Academy","Academy Converter","Academies","Secondary",253,268,5.9288537549407216E-2,31500,"",33368]
[330,"Birmingham",136589,4108,3304108,"Bartley Green School","Academy Converter","Academies","Secondary",188,183,-2.6595744680851019E-2,26000,"",25309]
[330,"Birmingham",138141,4109,3304109,"Perry Beeches the Academy","Academy Converter","Academies","Secondary",191,187,-2.0942408376963373E-2,11000,"",10770]
[330,"Birmingham",103493,4115,3304115,"Bordesley Green Girls' School & Sixth Form","Community School","LA maintained schools","Secondary",118,123,4.2372881355932313E-2,8500,"",8860,{"$f":"VLOOKUP(D38,DFES!$A:$C,2,FALSE)","v":"BORDESLEY GREEN GIRLS Sec (16+) "}]
[330,"Birmingham",143438,4129,3304129,"Dame Elizabeth Cadbury Technology College","Academy Converter","Academies","Secondary",127,129,1.5748031496062964E-2,9500,"",9650]
[330,"Birmingham",103497,4173,3304173,"Queensbridge School","Foundation School","LA maintained schools","Secondary",168,176,4.7619047619047672E-2,16500,"",17286,{"$f":"VLOOKUP(D40,DFES!$A:$C,2,FALSE)","v":"QUEENSBRIDGE Sec "}]
[330,"Birmingham",103498,4177,3304177,"Selly Park Technology College for Girls","Community School","LA maintained schools","Secondary",138,135,-2.1739130434782594E-2,14000,"",13696,{"$f":"VLOOKUP(D41,DFES!$A:$C,2,FALSE)","v":"SELLY PARK TECH COLLEGE FOR GIRLS Sec "}]
[330,"Birmingham",103499,4187,3304187,"Turves Green Girls' School","Foundation School","LA maintained schools","Secondary",106,103,-2.8301886792452824E-2,12000,"",11660,{"$f":"VLOOKUP(D42,DFES!$A:$C,2,FALSE)","v":"TURVES GREEN GIRLS Sec "}]
[330,"Birmingham",103500,4188,3304188,"Turves Green Boys' School","Community School","LA maintained schools","Secondary",105,134,0.2761904761904761,14500,"",18505,{"$f":"VLOOKUP(D43,DFES!$A:$C,2,FALSE)","v":"TURVES GREEN BOYS Sec "}]
[330,"Birmingham",103501,4193,3304193,"Wheelers Lane Technology College","Community School","LA maintained schools","Secondary",128,128,0,11000,"",11000,{"$f":"VLOOKUP(D44,DFES!$A:$C,2,FALSE)","v":"WHEELERS LANE Sec "}]
[330,"Birmingham",103503,4201,3304201,"Hodge Hill College","Community School","LA maintained schools","Secondary",251,247,-1.5936254980079667E-2,30500,"",30014,{"$f":"VLOOKUP(D45,DFES!$A:$C,2,FALSE)","v":"HODGE HILL Sec "}]
[330,"Birmingham",138137,4206,3304206,"Stockland Green School","Academy Converter","Academies","Secondary",149,155,4.0268456375838868E-2,16500,"",17164]
[330,"Birmingham",138937,4207,3304207,"Handsworth Wood Girls' Academy","Academy Converter","Academies","Secondary",149,159,6.7114093959731447E-2,15500,"",16540]
[330,"Birmingham",136882,4220,3304220,"Aston Manor Academy","Academy Converter","Academies","Secondary",149,152,2.0134228187919545E-2,17000,"",17342]
[330,"Birmingham",103509,4223,3304223,"Holte School","Community School","LA maintained schools","Secondary",194,192,-1.0309278350515427E-2,21000,"",20784,{"$f":"VLOOKUP(D49,DFES!$A:$C,2,FALSE)","v":"HOLTE Sec (16+) "}]
[330,"Birmingham",139841,4227,3304227,"Broadway Academy","Academy Converter","Academies","Secondary",210,209,-4.761904761904745E-3,23000,"",22890]
[330,"Birmingham",103514,4237,3304237,"Swanshurst School","Community School","LA maintained schools","Secondary",294,295,3.4013605442175798E-3,22500,"",22577,{"$f":"VLOOKUP(D51,DFES!$A:$C,2,FALSE)","v":"SWANSHURST Sec (16+) "}]
[330,"Birmingham",139746,4240,3304240,"Hamstead Hall Academy","Academy Converter","Academies","Secondary",187,185,-1.0695187165775444E-2,25000,"",24733]
[330,"Birmingham",137034,4241,3304241,"Holyhead School","Academy Converter","Academies","Secondary",211,210,-4.7393364928910442E-3,19000,"",18910]
[330,"Birmingham",103518,4244,3304244,"The International School","Community School","LA maintained schools","Secondary",86,96,0.11627906976744184,15000,"",16744,{"$f":"VLOOKUP(D54,DFES!$A:$C,2,FALSE)","v":"INTERNATIONAL SCHOOL & COMM.COLLEGE Sec (16+) "}]
[330,"Birmingham",103519,4245,3304245,"Moseley School","Foundation School","LA maintained schools","Secondary",216,229,6.0185185185185119E-2,25500,"",27035,{"$f":"VLOOKUP(D55,DFES!$A:$C,2,FALSE)","v":"MOSELEY Sec (16+) "}]
[330,"Birmingham",139994,4246,3304246,"Yardleys School","Academy Converter","Academies","Secondary",187,185,-1.0695187165775444E-2,23000,"",22754]
[330,"Birmingham",136778,4300,3304300,"Sutton Coldfield Grammar School for Girls","Academy Converter","Academies","Secondary",178,179,5.6179775280897903E-3,0,"",0]
[330,"Birmingham",103522,4301,3304301,"John Willmott School","Community School","LA maintained schools","Secondary",195,184,-5.6410256410256432E-2,9000,"",8492,{"$f":"VLOOKUP(D58,DFES!$A:$C,2,FALSE)","v":"JOHN WILLMOTT Sec (16+) "}]
[330,"Birmingham",138136,4307,3304307,"The Arthur Terry School","Academy Converter","Academies","Secondary",287,248,-0.13588850174216027,7500,"",6481]
[330,"Birmingham",138059,4323,3304323,"Rockwood Academy","Academy Converter","Academies","Secondary",121,122,8.2644628099173278E-3,19000,"",19157]
[330,"Birmingham",137053,4331,3304331,"Plantsbrook School","Academy Converter","Academies","Secondary",225,225,0,13000,"",13000]
[330,"Birmingham",103529,4333,3304333,"Balaam Wood School","Community School","LA maintained schools","Secondary",67,74,0.10447761194029859,8500,"",9388,{"$f":"VLOOKUP(D62,DFES!$A:$C,2,FALSE)","v":"BALAAM WOOD Sec "}]
[330,"Birmingham",133306,4334,3304334,"Al-Hijrah School","Voluntary Aided School","LA maintained schools","All Through",59,58,-1.6949152542372836E-2,5500,"",5407,{"$f":"VLOOKUP(D63,DFES!$A:$C,2,FALSE)","v":"AL-HIJRAH Sec "}]
[330,"Birmingham",103531,4606,3304606,"St Paul's School for Girls","Voluntary Aided School","LA maintained schools","Secondary",160,166,3.7500000000000089E-2,9000,"",9338,{"$f":"VLOOKUP(D64,DFES!$A:$C,2,FALSE)","v":"ST PAUL'S RC GIRLS Sec (16+) "}]
[330,"Birmingham",141835,4616,3304616,"St Thomas Aquinas Catholic School","Academy Converter","Academies","Secondary",205,207,9.7560975609756184E-3,11500,"",11612]
[330,"Birmingham",103534,4625,3304625,"St John Wall Catholic School","Voluntary Aided School","LA maintained schools","Secondary",118,120,1.6949152542372836E-2,19500,"",19831,{"$f":"VLOOKUP(D66,DFES!$A:$C,2,FALSE)","v":"ST JOHN WALL RC Sec "}]
[330,"Birmingham",137988,4660,3304660,"Bishop Vesey's Grammar School","Academy Converter","Academies","Secondary",160,160,0,0,"",0]
[330,"Birmingham",140524,4661,3304661,"Bishop Walsh Catholic School","Academy Converter","Academies","Secondary",175,156,-0.10857142857142854,1500,"",1337]
[330,"Birmingham",103537,4663,3304663,"St Edmund Campion Catholic School & Sixth Form Centre","Voluntary Aided School","LA maintained schools","Secondary",184,185,5.4347826086955653E-3,25500,"",25639,{"$f":"VLOOKUP(D69,DFES!$A:$C,2,FALSE)","v":"ST EDMUND CAMPION RC Sec (16+) "}]
[330,"Birmingham",103538,4664,3304664,"Holy Trinity Catholic Media Arts College","Voluntary Aided School","LA maintained schools","Secondary",105,115,9.5238095238095344E-2,12500,"",13690,{"$f":"VLOOKUP(D70,DFES!$A:$C,2,FALSE)","v":"HOLY TRINITY RC Sec "}]
[330,"Birmingham",103539,4801,3304801,"Cardinal Wiseman Catholic Technology College","Voluntary Aided School","LA maintained schools","Secondary",115,119,3.4782608695652195E-2,10000,"",10348,{"$f":"VLOOKUP(D71,DFES!$A:$C,2,FALSE)","v":"CARDINAL WISEMAN RC Sec "}]
[330,"Birmingham",103541,4804,3304804,"Archbishop Ilsley Catholic School","Voluntary Aided School","LA maintained schools","Secondary",201,210,4.4776119402984982E-2,20000,"",20896,{"$f":"VLOOKUP(D72,DFES!$A:$C,2,FALSE)","v":"ARCHBISHOP ILSLEY RC Sec (16+) "}]
[330,"Birmingham",139738,5400,3305400,"The Baverstock Academy","Academy Converter","Academies","Secondary",125,52,-0.58400000000000007,10000,"",4160]
[330,"Birmingham",103548,5401,3305401,"Small Heath School","Foundation School","LA maintained schools","Secondary",199,211,6.0301507537688481E-2,16000,"",16965,{"$f":"VLOOKUP(D74,DFES!$A:$C,2,FALSE)","v":"SMALL HEATH Sec (16+) "}]
[330,"Birmingham",103549,5402,3305402,"Handsworth Grammar School","Voluntary Aided School","LA maintained schools","Secondary",150,150,0,0,"",0,{"$f":"VLOOKUP(D75,DFES!$A:$C,2,FALSE)","v":"HANDSWORTH GRAMMAR Sec (16+) "}]
[330,"Birmingham",143435,5403,3305403,"Great Barr Academy","Academy Converter","Academies","Secondary",272,320,{"$f":"IF(J76=0,\"\",K76/J76-1)","v":0.17647058823529416},30500,"",{"$f":"ROUND(IF(ISNUMBER(L76),M76*L76+M76,N76*K76*500),0)","v":35882}]
[330,"Birmingham",137047,{"$f":"E77-3300000","v":5404},3305404,"King Edward VI Handsworth School","Academy Converter","Academies","Secondary",160,160,0,0,"",0]
[330,"Birmingham",137046,5405,3305405,"King Edward VI Five Ways School","Academy Converter","Academies","Secondary",180,179,-5.5555555555555358E-3,500,"",497]
[330,"Birmingham",137044,5406,3305406,"King Edward VI Camp Hill School for Girls","Academy Converter","Academies","Secondary",150,150,0,0,"",0]
[330,"Birmingham",137045,5407,3305407,"King Edward VI Camp Hill School for Boys","Academy Converter","Academies","Secondary",120,121,8.3333333333333037E-3,0,"",0]
[330,"Birmingham",137043,5408,3305408,"King Edward VI Aston School","Academy Converter","Academies","Secondary",120,119,-8.3333333333333037E-3,0,"",0]
[330,"Birmingham",137858,5409,3305409,"Hall Green School","Academy Converter","Academies","Secondary",176,180,2.2727272727272707E-2,15000,"",15341]
[330,"Birmingham",136908,5410,3305410,"Fairfax","Academy Converter","Academies","Secondary",252,249,-1.1904761904761862E-2,13500,"",13339]
[330,"Birmingham",136406,5411,3305411,"Ninestiles, an Academy","Academy Converter","Academies","Secondary",295,297,6.7796610169490457E-3,23500,"",23659]
[330,"Birmingham",138695,5412,3305412,"George Dixon Academy","Academy Converter","Academies","Secondary",164,176,7.3170731707317138E-2,32500,"",34878]
[330,"Birmingham",103560,5413,3305413,"Bishop Challoner Catholic College","Voluntary Aided School","LA maintained schools","Secondary",196,190,-3.0612244897959218E-2,6500,"",6301,{"$f":"VLOOKUP(D86,DFES!$A:$C,2,FALSE)","v":"BISHOP CHALLONER Sec (16+) "}]
[330,"Birmingham",136590,5414,3305414,"Kings Norton Girls' School","Academy Converter","Academies","Secondary",158,161,1.8987341772152E-2,6000,"",6114]
[330,"Birmingham",103562,5415,3305415,"King's Norton Boys' School","Foundation School","LA maintained schools","Secondary",122,121,-8.1967213114754189E-3,10500,"",10414,{"$f":"VLOOKUP(D88,DFES!$A:$C,2,FALSE)","v":"KINGS NORTON BOYS Sec (16+) "}]
[330,"Birmingham",103563,5416,3305416,"Colmers School and Sixth Form College","Foundation School","LA maintained schools","Secondary",210,209,-4.761904761904745E-3,16500,"",16421,{"$f":"VLOOKUP(D89,DFES!$A:$C,2,FALSE)","v":"COLMERS Sec "}]
[330,"Birmingham",135907,6905,3306905,"Heartlands Academy","Academy Sponsor Led","Academies","Secondary",158,162,2.5316455696202445E-2,13000,"",13329]
[330,"Birmingham",136152,6906,3306906,"King Edward VI Sheldon Heath Academy","Academy Sponsor Led","Academies","Secondary",222,222,0,22000,"",22000]
[330,"Birmingham",135911,6907,3306907,"Shenley Academy","Academy Sponsor Led","Academies","Secondary",205,203,-9.7560975609756184E-3,15000,"",14854]
[330,"Birmingham",135970,6908,3306908,"Ark St Alban's Academy","Academy Sponsor Led","Academies","Secondary",125,121,-3.2000000000000028E-2,15000,"",14520]
[330,"Birmingham",136032,6909,3306909,"North Birmingham Academy","Academy Sponsor Led","Academies","Secondary",177,185,4.5197740112994378E-2,17000,"",17768]
[330,"Birmingham",136213,6910,3306910,"Harborne Academy","Academy Sponsor Led","Academies","Secondary",118,117,-8.4745762711864181E-3,15500,"",15369]
[330,"Birmingham",103601,7009,3307009,"Victoria School","Community Special School","Special schools","Not applicable",15,12,-0.19999999999999996,7500,"",6000,{"$f":"VLOOKUP(D96,DFES!$A:$C,2,FALSE)","v":"VICTORIA Spcl"}]
[330,"Birmingham",141252,7013,3307013,"Calthorpe Teaching Academy","Academy Special Converter","Academies","Not applicable",32,34,6.25E-2,16000,"",17000]
[330,"Birmingham",103605,7014,3307014,"Uffculme School","Community Special School","Special schools","Not applicable",8,14,0.75,3500,"",6125,{"$f":"VLOOKUP(D98,DFES!$A:$C,2,FALSE)","v":"UFFCULME Spcl"}]
[330,"Birmingham",103606,7016,3307016,"Baskerville School","Community Special School","Special schools","Not applicable",14,17,0.21428571428571419,6500,"",7893,{"$f":"VLOOKUP(D99,DFES!$A:$C,2,FALSE)","v":"BASKERVILLE Spcl"}]
[330,"Birmingham",103609,7026,3307026,"Hunters Hill Technology College","Community Special School","Special schools","Not applicable",23,26,0.13043478260869557,9500,"",10739,{"$f":"VLOOKUP(D100,DFES!$A:$C,2,FALSE)","v":"HUNTERS HILL Spcl"}]
[330,"Birmingham",103610,7027,3307027,"Hallmoor School","Community Special School","Special schools","Not applicable",32,20,-0.375,15500,"",9688,{"$f":"VLOOKUP(D101,DFES!$A:$C,2,FALSE)","v":"HALLMOOR Spcl"}]
[330,"Birmingham",103611,7030,3307030,"Braidwood School for the Deaf","Foundation Special School","Special schools","Not applicable",10,5,-0.5,5000,"",2500,{"$f":"VLOOKUP(D102,DFES!$A:$C,2,FALSE)","v":"BRAIDWOOD Spcl"}]
[330,"Birmingham",138281,7031,3307031,"Wilson Stuart School","Academy Special Converter","Academies","Not applicable",17,17,0,6500,"",6500]
[330,"Birmingham",103613,7033,3307033,"Selly Oak Trust School","Foundation Special School","Special schools","Not applicable",64,57,-0.109375,30500,"",27164,{"$f":"VLOOKUP(D104,DFES!$A:$C,2,FALSE)","v":"SELLY OAK Spcl"}]
[330,"Birmingham",103614,7034,3307034,"Priestley Smith School","Community Special School","Special schools","Not applicable",8,6,-0.25,3000,"",2250,{"$f":"VLOOKUP(D105,DFES!$A:$C,2,FALSE)","v":"PRIESTLEY SMITH Spcl"}]
[330,"Birmingham",103615,7035,3307035,"The Dame Ellen Pinsent School","Community Special School","Special schools","Not applicable",0,1,"",0,0.20897771433103338,104,{"$f":"VLOOKUP(D106,DFES!$A:$C,2,FALSE)","v":"DAME ELLEN PINSENT Spcl"}]
[330,"Birmingham",103616,7036,3307036,"Queensbury School","Community Special School","Special schools","Not applicable",34,3,-0.91176470588235292,15500,"",1368,{"$f":"VLOOKUP(D107,DFES!$A:$C,2,FALSE)","v":"QUEENSBURY Spcl"}]
[330,"Birmingham",103619,7040,3307040,"Mayfield School","Community Special School","Special schools","Not applicable",16,22,0.375,8000,"",11000,{"$f":"VLOOKUP(D108,DFES!$A:$C,2,FALSE)","v":"MAYFIELD Spcl"}]
[330,"Birmingham",103625,7050,3307050,"Fox Hollies School and Performing Arts College","Community Special School","Special schools","Not applicable",10,11,0.10000000000000009,4500,"",4950,{"$f":"VLOOKUP(D109,DFES!$A:$C,2,FALSE)","v":"FOX HOLLIES Spcl"}]
[330,"Birmingham",103628,7053,3307053,"Oscott Manor School","Community Special School","Special schools","Not applicable",15,16,6.6666666666666652E-2,6000,"",6400,{"$f":"VLOOKUP(D110,DFES!$A:$C,2,FALSE)","v":"OSCOTT MANOR Spcl"}]
[330,"Birmingham",103632,7062,3307062,"Lindsworth School","Community Special School","Special schools","Not applicable",8,12,0.5,3000,"",4500,{"$f":"VLOOKUP(D111,DFES!$A:$C,2,FALSE)","v":"LINDSWORTH Spcl"}]
[330,"Birmingham",139526,7063,3307063,"James Brindley School","Academy Special Converter","Academies","Not applicable",13,10,-0.23076923076923073,2500,"",1923]