{"text_format":"1","workbook":"xlsx","n_sheets":7,"sheets":["Start","School List","Allocation","DFES","DFE Notification 18-19","DFE Notification 17-18","DFE Notification 16-17"],"not_rendered":{"charts":0,"images":2,"macros":1,"external_links":0,"defined_names":11,"comments":0,"pivot_tables":0},"unopened":[],"bounds":{"document_bytes":16777216,"sheet_cells":100000,"rows_first":2000,"rows_last":500,"rows_between":2000,"halvings":0,"cell_chars":16384,"cell_head_chars":4096},"cells_cut":0,"cells_raw":0,"read":"whole","date_system":"1900"}

{"sheet":"Start","index":0,"n_rows":326,"n_cols":16,"rows_kept":326,"cut":false,"hidden":false,"merged":[]}
[null,null,null,{"$f":"IF(ISNA(VLOOKUP($E$1,$A$100:$B$598,2,0)),0,VLOOKUP($E$1,$A$100:$B$598,2,0))","v":2183},{"$f":"+DFES!E1","v":2183},null,null,null,null,null,null,null,null,null,"Allocation",{"$f":"IF(ISNA(VLOOKUP($E$1,DFES!$A$10:$J$438,3,0)),0,VLOOKUP($E$1,DFES!$A$10:$J$438,3,0))","v":2640}]
[]
[]
[]
[]
[]
[]
[]
[null,"2018/19 Free School Meals Supplementary Grant"]
[]
[null,"Please Left Click on the Macro Button below to continue."]
[null,"If the aforementioned does not function, please refer to the Macro Guidance on the budget pages>>.",null,null,null,null,null,null,null,null,null,null,"macro guidance"]
[null,"Should the Protected View message be visible on the Toolbar, click on Enable Editing."]
[]
[]
[]
[]
[]
[]
[]
[]
[]
[]
[]
[]
[]
[]
[]
[]
[]
{"$rows_left_out":297}
{"sheet":"School List","index":1,"n_rows":434,"n_cols":79,"rows_kept":434,"cut":false,"hidden":true,"merged":[[0,2,4,2],[0,5,4,5],[0,3,4,3]]}
[null,null,null,null,null,null,null,null,null,null,null,null,null,null,null,null,null,null,null,null,null,null,null,null,null,null,null,null,null,null,null,null,null,null,null,null,null,null,null,null,null,null,null,null,null,null,null,null,null,null,null,null,null,null,null,null,null,null,null,null,null,null,null,null,null,null,null,null,null,null,null,null,null,null,null,null,null,null,"ok"]
[]
[]
["DFE","School"]
["Number","Name"]
[3318,"ABBEY RC JI "]
[2020,"ACOCKS GREEN ACADEMY"]
[2010,"ADDERLEY JI "]
[1027,"ADDERLEY Nrsy "]
[3433,"ALBERT BRADBEER JI NC"]
[5949,"AL-FURQAN JI "]
[4334,"AL-HIJRAH Sec "]
[2153,"ALLENS CROFT JI "]
[1017,"ALLENS CROFT Nrsy "]
[2472,"ALSTON JI NC"]
[2062,"ANDERTON PARK JI NC"]
[2479,"ANGLESEY JI NC"]
[4804,"ARCHBISHOP ILSLEY RC Sec (16+) "]
[2300,"ARDEN JI NC"]
[2041,"ARK ROSE ACADEMY"]
[2056,"ARK TINDAL ACADEMY"]
[4307,"ARTHUR TERRY ACAD Sec (16+) "]
[4220,"ASTON MANOR ACADEMY"]
[2443,"ASTON TOWER JI NC"]
[3412,"AUDLEY JI NC"]
[4333,"BALAAM WOOD Sec "]
[2026,"BANNERS GATE PRIMARY SCHOOL JI NC"]
[2014,"BARFORD JI NC"]
[4108,"BARTLEY GREEN ACADEMY"]
[7016,"BASKERVILLE Spcl"]
{"$rows_left_out":405}
{"sheet":"Allocation","index":2,"n_rows":46,"n_cols":12,"rows_kept":46,"cut":false,"hidden":true,"merged":[[37,3,37,12],[30,3,30,9],[41,3,41,12],[42,3,42,12],[43,3,43,12],[26,3,29,9],[15,3,16,11],[6,3,6,11],[7,3,7,11],[8,3,8,11],[9,3,9,11],[11,5,11,12],[12,5,12,10]]}
[null,null,null,null,null,{"$f":"IF(E14>0,\"S\",\"P\")","v":"P"}]
[]
[]
[]
[]
[]
[]
[null,null,null,"School Budget Share Addition"]
[null,null,null,"2018/19 Free School Meals Supplementary Grant"]
[]
[]
[null,null,null,"School Name:",null,{"$f":"DFES!F1","v":"ST BENEDICT'S I NC"}]
[null,null,null,"DFE No:",null,{"$f":"DFES!E1","v":2183}]
[]
[]
[null,null,null,"School Budget Share Addition Allocation Analysis"]
[]
[]
[null,null,null,null,null,null,null,null,null,"Oct 17  Total FSM number of pupils","Oct 18 Total FSM number of pupils","Change in FSM pupil numbers between 2017 and 2018"]
[null,null,null,"DFE Determined Data",null,null,null,null,null,{"$f":"IF(H21=\"g\",\"\",(VLOOKUP($F13+3300000,'DFE Notification 18-19'!B:M,6,0)))","v":45},{"$f":"IF($H$21=\"g\",\"\",(VLOOKUP($F13+3300000,'DFE Notification 18-19'!$B:$M,7,0)))","v":66},{"$f":"IF($H$21=\"g\",\"\",(VLOOKUP($F13+3300000,'DFE Notification 18-19'!$B:$M,8,0)))","v":21}]
[null,null,null,"DFE Determined Data Growing Schools **",null,null,null,{"$f":"IFERROR(VLOOKUP(DFES!$E$1+3300000,'DFE Notification 18-19'!$B$2:$N$228,13,FALSE),\"\")","v":0},null,{"$f":"IF($H21=\"g\",(VLOOKUP($F13+3300000,'DFE Notification 18-19'!$B:$M,9,FALSE)),\"\")","v":""},{"$f":"IF($H21=\"g\",(VLOOKUP($F13+3300000,'DFE Notification 18-19'!$B:$M,10,FALSE)),\"\")","v":""},{"$f":"IF($H21=\"g\",(VLOOKUP($F13+3300000,'DFE Notification 18-19'!$B:$M,11,FALSE)),\"\")","v":""}]
[null,null,null,null,null,null,null,null,null,null,"Rate per FSM *",440]
[]
[null,null,null,"Total School Budget Share - 2018/19 Free School Meals Supplementary Grant",null,null,null,null,null,null,null,{"$f":"VLOOKUP($F13+3300000,'DFE Notification 18-19'!B:M,12,0)","v":2640}]
[]
[]
[null,null,null,"* The rate of £440 is only applied to positive changes in FSM pupil numbers. Reductions in FSM numbers receive no funding."]
[]
[]
[]
{"$rows_left_out":17}
{"sheet":"DFES","index":3,"n_rows":439,"n_cols":6,"rows_kept":439,"cut":false,"hidden":true,"merged":[]}
[null,null,null,null,2183,{"$f":"IF(ISNA(VLOOKUP($E$1,$A$10:$K$438,2,0)),0,VLOOKUP($E$1,$A$10:$K$438,2,0))","v":"ST BENEDICT'S I NC"}]
[]
[]
[]
[]
[]
[null,null,"2018-2019FSM Supp"]
[]
[null,null,"ALLOCATIONS"]
[1000,"SELLY OAK Nrsy ",{"$f":"IFERROR(VLOOKUP(A10+3300000,'DFE Notification 18-19'!B:M,12,0),0)","v":0}]
[1001,"BORDESLEY GREEN Nrsy ",{"$f":"IFERROR(VLOOKUP(A11+3300000,'DFE Notification 18-19'!B:M,12,0),0)","v":0}]
[1002,"BREARLEY ST Nrsy ",{"$f":"IFERROR(VLOOKUP(A12+3300000,'DFE Notification 18-19'!B:M,12,0),0)","v":0}]
[1006,"GARRETTS GREEN Nrsy ",{"$f":"IFERROR(VLOOKUP(A13+3300000,'DFE Notification 18-19'!B:M,12,0),0)","v":0}]
[1008,"PERRY BEECHES Nrsy ",{"$f":"IFERROR(VLOOKUP(A14+3300000,'DFE Notification 18-19'!B:M,12,0),0)","v":0}]
[1009,"ST THOMAS Nrsy ",{"$f":"IFERROR(VLOOKUP(A15+3300000,'DFE Notification 18-19'!B:M,12,0),0)","v":0}]
[1010,"HIGHFIELD Nrsy ",{"$f":"IFERROR(VLOOKUP(A16+3300000,'DFE Notification 18-19'!B:M,12,0),0)","v":0}]
[1012,"MARSH HILL Nrsy ",{"$f":"IFERROR(VLOOKUP(A17+3300000,'DFE Notification 18-19'!B:M,12,0),0)","v":0}]
[1014,"WEST HEATH Nrsy ",{"$f":"IFERROR(VLOOKUP(A18+3300000,'DFE Notification 18-19'!B:M,12,0),0)","v":0}]
[1015,"GOODWAY Nrsy ",{"$f":"IFERROR(VLOOKUP(A19+3300000,'DFE Notification 18-19'!B:M,12,0),0)","v":0}]
[1016,"KINGS NORTON Nrsy ",{"$f":"IFERROR(VLOOKUP(A20+3300000,'DFE Notification 18-19'!B:M,12,0),0)","v":0}]
[1017,"ALLENS CROFT Nrsy ",{"$f":"IFERROR(VLOOKUP(A21+3300000,'DFE Notification 18-19'!B:M,12,0),0)","v":0}]
[1018,"RUBERY Nrsy ",{"$f":"IFERROR(VLOOKUP(A22+3300000,'DFE Notification 18-19'!B:M,12,0),0)","v":0}]
[1019,"WASHWOOD HEATH Nrsy ",{"$f":"IFERROR(VLOOKUP(A23+3300000,'DFE Notification 18-19'!B:M,12,0),0)","v":0}]
[1020,"WEOLEY CASTLE Nrsy ",{"$f":"IFERROR(VLOOKUP(A24+3300000,'DFE Notification 18-19'!B:M,12,0),0)","v":0}]
[1021,"HIGHTERS HEATH Nrsy ",{"$f":"IFERROR(VLOOKUP(A25+3300000,'DFE Notification 18-19'!B:M,12,0),0)","v":0}]
[1022,"GRACELANDS Nrsy ",{"$f":"IFERROR(VLOOKUP(A26+3300000,'DFE Notification 18-19'!B:M,12,0),0)","v":0}]
[1023,"JAKEMAN Nrsy ",{"$f":"IFERROR(VLOOKUP(A27+3300000,'DFE Notification 18-19'!B:M,12,0),0)","v":0}]
[1024,"LILLIAN DE LISSA Nrsy ",{"$f":"IFERROR(VLOOKUP(A28+3300000,'DFE Notification 18-19'!B:M,12,0),0)","v":0}]
[1025,"BLOOMSBURY Nrsy ",{"$f":"IFERROR(VLOOKUP(A29+3300000,'DFE Notification 18-19'!B:M,12,0),0)","v":0}]
[1026,"FEATHERSTONE Nrsy ",{"$f":"IFERROR(VLOOKUP(A30+3300000,'DFE Notification 18-19'!B:M,12,0),0)","v":0}]
{"$rows_left_out":410}
{"sheet":"DFE Notification 18-19","index":4,"n_rows":230,"n_cols":13,"rows_kept":230,"cut":false,"hidden":true,"merged":[]}
[null,"LAEstab","School Name","Phase of Education","Oct 17 year group count","Oct 18 year group count","Oct 17  Total FSM number of pupils","Oct 18 Total FSM number of pupils","Difference in FSM pupils numbers","Oct 17 Average per year group for growing schools only","Oct 18 Average per year group for growing schools only","Difference in average per year group for growing schools only ","Allocations"]
[null,3301100,"City of Birmingham School","Not applicable",12,11,169,228,59,"","","",25960]
[null,3302004,"Mapledene Primary School","Primary",7,7,69,71,2,"","","",880]
[null,3302005,"Kings Heath Primary School","Primary",7,7,64,76,12,"","","",5280]
[null,3302008,"Shaw Hill Primary School","Primary",7,7,108,109,1,"","","",440]
[null,3302010,"Adderley Primary School","Primary",7,7,232,183,-49,"","","",0.01]
[null,3302011,"Wheelers Lane Primary School","Primary",7,7,85,124,39,"","","",17160]
[null,3302014,"Barford Primary School","Primary",7,7,121,121,0,"","","",0.01]
[null,3302015,"James Watt Primary School","Primary",7,7,128,138,10,"","","",4400]
[null,3302016,"Beeches Junior School","Primary",4,4,54,66,12,"","","",5280]
[null,3302017,"Beeches Infant School","Primary",3,3,48,57,9,"","","",3960]
[null,3302018,"The Oaks Primary School","Primary",7,7,218,248,30,"","","",13200]
[null,3302021,"Paganel Primary School","Primary",7,7,148,155,7,"","","",3080]
[null,3302024,"Birches Green Junior School","Primary",4,4,85,87,2,"","","",880]
[null,3302025,"Birches Green Infant School","Primary",3,3,83,85,2,"","","",880]
[null,3302026,"Banners Gate Primary School","Primary",7,7,106,91,-15,"","","",0.01]
[null,3302030,"Bordesley Green Primary School","Primary",7,7,128,147,19,"","","",8360]
[null,3302040,"Cherry Orchard Primary School","Primary",7,7,61,59,-2,"","","",0.01]
[null,3302052,"Colmers Farm Primary School","Primary",7,7,185,184,-1,"","","",0.01]
[null,3302053,"Colmore Junior School","Primary",4,4,46,50,4,"","","",1760]
[null,3302054,"Colmore Infant and Nursery School","Primary",4,3,27,36,9,"","","",3960]
[null,3302055,"Cotteridge Primary School","Primary",7,7,92,135,43,"","","",18920]
[null,3302062,"Anderton Park Primary School","Primary",7,7,150,166,16,"","","",7040]
[null,3302063,"Regents Park Community Primary School","Primary",7,7,172,174,2,"","","",880]
[null,3302067,"Summerfield Junior and Infant School","Primary",7,7,132,144,12,"","","",5280]
[null,3302079,"George Dixon Primary School","Primary",7,7,190,181,-9,"","","",0.01]
[null,3302081,"Gilbertstone Primary School","Primary",7,7,57,74,17,"","","",7480]
[null,3302087,"Grendon Junior and Infant School (NC)","Primary",7,7,122,137,15,"","","",6600]
[null,3302091,"Gunter Primary School","Primary",7,7,77,74,-3,"","","",0.01]
[null,3302092,"Hall Green Junior School","Primary",4,4,52,52,0,"","","",0.01]
{"$rows_left_out":201}
{"sheet":"DFE Notification 17-18","index":5,"n_rows":53,"n_cols":16,"rows_kept":53,"cut":false,"hidden":true,"merged":[]}
[null,null,null,"Y7 catch-up premium for financial year 2017 to 2018"]
[null,null,null,"State-funded maintained schools, academies, maintained special schools, special academies, pupil referral units (PRU) and alternative provisions(AP) academies"]
[null,null,null,"By school"]
[null,null,null,"Please note : for schools with no pupils in Year 7 in October 2016 we have used local authority proportion of eligible pupils in 2015-2016 as shown in column N. This percentage is multiplied by the 2017-2018 year 7 cohort and the 2015-16 per pupil rate of £500."]
[null,null,null,"This is the sum of all eligible pupils in the local authority in 2015-16 divided by the sum of pupils in Year 7 in the local authority in October 2016, excluding pupils in schools that did not receive funding in 2016-2016 (ie had no eligible pupils in 2015-2016)."]
[]
[null,null,null,"(1) Status as at January 2018"]
[null,null,null,"(2) number of pupils in Year 7 ( or aged 11 in Year group X) from the Oct 2016 schools census "]
[null,null,null,"(3) number of pupils in Year 7 ( or aged 11 in Year group X) from the Oct 2017 schools census  "]
[null,"LA Name","         URN",null,null," LAestab","Current Establishment Name","Type Of Establishment ","Establishment Type Group(2) ","Phase Of Education","2015-2016 Year 7 Cohort(3)","2016-2017 Year 7 Cohort(4)","% Change in Cohort between 2015 and 2016","Funding in 2015-2016","2015-2016 LA proportion","2016-2017 Funding"]
[]
[null,"LA Number","LA Name","         URN",null," LAestab","Current Establishment Name","Type Of Establishment ","Establishment Type Group(1) ","Phase of Education","2016-2017 Year 7 Cohort(2)","2017-2018 Year    7 Cohort(3)","% Change in Cohort between 2015-2016 and 2017-2018","Funding in 2016-2017","2015-2016 LA proportion of eligible pupils","2017-2018 Funding"]
[null,330,"Birmingham",103146,{"$f":"F13-3300000","v":1100},3301100,"City of Birmingham School","Pupil referral unit","LA maintained schools","Not applicable",0,3,"",0,0.20897771433103338,313]
[null,330,"Birmingham",103258,2179,3302179,"Starbank  School","Community school","LA maintained schools","All through",179,182,1.6759776536312776E-2,19646,null,19975]
[null,330,"Birmingham",103483,4015,3304015,"Hodge Hill Girls' School","Community school","LA maintained schools","Secondary",150,150,0,15500,null,15500]
[null,330,"Birmingham",103486,4063,3304063,"Kings Heath Boys","Community school","LA maintained schools","Secondary",117,121,3.4188034188034289E-2,8500,null,8791]
[null,330,"Birmingham",103493,4115,3304115,"Bordesley Green Girls' School & Sixth Form","Community school","LA maintained schools","Secondary",123,118,-4.065040650406504E-2,8860,null,8500]
[null,330,"Birmingham",103497,4173,3304173,"Queensbridge School","Foundation school","LA maintained schools","Secondary",176,176,0,17286,null,17286]
[null,330,"Birmingham",103498,4177,3304177,"Selly Park Technology College for Girls","Community school","LA maintained schools","Secondary",135,136,7.4074074074073071E-3,13696,null,13797]
[null,330,"Birmingham",103499,4187,3304187,"Turves Green Girls' School","Foundation school","LA maintained schools","Secondary",103,141,0.36893203883495151,11660,null,15962]
[null,330,"Birmingham",103500,4188,3304188,"Turves Green Boys' School","Community school","LA maintained schools","Secondary",134,136,1.4925373134328401E-2,18505,null,18781]
[null,330,"Birmingham",103501,4193,3304193,"Wheelers Lane Technology College","Community school","LA maintained schools","Secondary",128,130,1.5625E-2,11000,null,11172]
[null,330,"Birmingham",103503,4201,3304201,"Hodge Hill College","Community school","LA maintained schools","Secondary",247,248,4.0485829959513442E-3,30014,null,30136]
[null,330,"Birmingham",103509,4223,3304223,"Holte School","Community school","LA maintained schools","Secondary",192,190,-1.041666666666663E-2,20784,null,20568]
[null,330,"Birmingham",103514,4237,3304237,"Swanshurst School","Community school","LA maintained schools","Secondary",295,304,3.050847457627115E-2,22577,null,23266]
[null,330,"Birmingham",103519,4245,3304245,"Moseley School and Sixth Form","Foundation school","LA maintained schools","Secondary",229,246,7.4235807860262071E-2,27035,null,29042]
[null,330,"Birmingham",103522,4301,3304301,"John Willmott School","Community school","LA maintained schools","Secondary",184,189,2.7173913043478271E-2,8492,null,8723]
[null,330,"Birmingham",103529,4333,3304333,"Balaam Wood School","Community school","LA maintained schools","Secondary",74,68,-8.108108108108103E-2,9388,null,8627]
[null,330,"Birmingham",103531,4606,3304606,"St Paul's School for Girls","Voluntary aided school","LA maintained schools","Secondary",166,167,6.0240963855422436E-3,9338,null,9394]
[null,330,"Birmingham",103534,4625,3304625,"St John Wall Catholic School","Voluntary aided school","LA maintained schools","Secondary",120,116,-3.3333333333333326E-2,19831,null,19170]
{"$rows_left_out":24}
{"sheet":"DFE Notification 16-17","index":6,"n_rows":112,"n_cols":16,"rows_kept":112,"cut":false,"hidden":true,"merged":[]}
["Y7 catch-up premium for financial year 2016 to 2017"]
["State-funded maintained schools, academies, maintained special schools, special academies, pupil referral units (PRU) and alternative provisions(AP) academies"]
["By school"]
["Please note : for schools with no pupils in Year 7 in October 2015 we have used local authority proportion of eligible pupils in 2015-2016 as shown in column N.  This is the sum of all eligible pupils in the local authority in 2015-16 divided by the sum of pupils in Year 7 in the local authority in October 2015, excluding pupils in schools that did not receive funding in 2015-16 (ie had no eligible pupils in 2015-2016)."]
["Shaded cells mean not applicable"]
["(1) Number of pupils in the LA as at Oct 2015 school census who did not achieve level 4 or above in maths or reading or both in their KS2 test in 2014-2015"]
["(2) Status as at January 2017"]
["(3) number of pupils in Year 7 ( or aged 11 in Year group X) from the Oct 2015 schools census ",null,null,null,null,null,null,null,null,null,"LA Number","LA Name","15-16 LA Cohort","15-16 LA    Number of eligible pupils(1)","15-16 LA proportion"]
["(4) number of pupils in Year 7 ( or aged 11 in Year group X) from the Oct 2016 schools census  ",null,null,null,null,null,null,null,null,null,301,"Barking and Dagenham",2588,478,{"$f":"N9/M9","v":0.18469860896445131}]
[]
["LA Number","LA Name","         URN",null," LAestab","Current Establishment Name","Type Of Establishment ","Establishment Type Group(2) ","Phase Of Education","2015-2016 Year 7 Cohort(3)","2016-2017 Year 7 Cohort(4)","% Change in Cohort between 2015 and 2016","Funding in 2015-2016","2015-2016 LA proportion","2016-2017 Funding"]
[330,"Birmingham",143413,{"$f":"E12-3300000","v":2168},3302168,"Erdington Academy","Academy Sponsor Led","Academies","Secondary",113,149,{"$f":"IF(J12=0,\"\",K12/J12-1)","v":0.31858407079646023},22000,"",{"$f":"ROUND(IF(ISNUMBER(L12),M12*L12+M12,N12*K12*500),0)","v":29009}]
[330,"Birmingham",103258,{"$f":"E13-3300000","v":2179},3302179,"Starbank  School","Community School","LA maintained schools","All Through",164,179,9.1463414634146423E-2,18000,"",{"$f":"ROUND(IF(ISNUMBER(L13),M13*L13+M13,N13*K13*500),0)","v":19646},{"$f":"VLOOKUP(D13,DFES!$A:$C,2,FALSE)","v":"STARBANK JI NC"}]
[330,"Birmingham",137578,4001,3304001,"Ark Kings Academy","Academy Sponsor Led","Academies","Secondary",63,114,0.80952380952380953,9500,"",{"$f":"ROUND(IF(ISNUMBER(L14),M14*L14+M14,N14*K14*500),0)","v":17190}]
[330,"Birmingham",138200,4002,3304002,"Perry Beeches II The Free School","Free Schools","Free Schools","Secondary",113,117,3.539823008849563E-2,11500,"",11907]
[330,"Birmingham",138586,4004,3304004,"Nishkam High School","Free Schools","Free Schools","Secondary",100,118,0.17999999999999994,8000,"",9440]
[330,"Birmingham",139047,4005,3304005,"Four Dwellings Academy","Academy Sponsor Led","Academies","Secondary",82,74,-9.7560975609756073E-2,12500,"",11280]
[330,"Birmingham",139048,4006,3304006,"Greenwood Academy","Academy Sponsor Led","Academies","Secondary",164,176,7.3170731707317138E-2,21500,"",23073]
[330,"Birmingham",142219,4009,3304009,"Waverley School","Academy Converter","Academies","All Through",184,193,4.8913043478260976E-2,21000,"",22027]
[330,"Birmingham",139797,4011,3304011,"Perry Beeches III the Free School","Free Schools","Free Schools","Secondary",103,96,-6.7961165048543659E-2,11000,"",10252]
[330,"Birmingham",137346,4012,3304012,"Hillcrest School A Specialist Maths and Computing College and Sixth Form Centre","Academy Converter","Academies","Secondary",85,83,-2.352941176470591E-2,10000,"",9765]
[330,"Birmingham",140014,4013,3304013,"Ark Boulton Academy","Academy Sponsor Led","Academies","Secondary",175,179,2.2857142857142909E-2,18000,"",18411]
[330,"Birmingham",140863,4014,3304014,"The University of Birmingham School","Free Schools","Free Schools","Secondary",149,149,0,8000,"",8000]
[330,"Birmingham",103483,4015,3304015,"Hodge Hill Girls' School","Community School","LA maintained schools","Secondary",150,150,0,15500,"",15500,{"$f":"VLOOKUP(D24,DFES!$A:$C,2,FALSE)","v":"HODGE HILL GIRLS Sec "}]
[330,"Birmingham",141003,4016,3304016,"Perry Beeches IV - The Free School","Free Schools","Free Schools","Secondary",116,115,-8.6206896551723755E-3,11000,"",10905]
[330,"Birmingham",141318,4017,3304017,"Bournville School","Academy Sponsor Led","Academies","All Through",123,148,0.20325203252032531,11500,"",13837]
[330,"Birmingham",141668,4018,3304018,"Saltley Academy","Academy Sponsor Led","Academies","Secondary",209,210,4.7846889952152249E-3,27500,"",27632]
[330,"Birmingham",141752,4019,3304019,"Perry Beeches V - The All Through Family School","Free Schools","Free Schools","All Through",142,114,-0.19718309859154926,11000,"",8831]
[330,"Birmingham",141943,4020,3304020,"King Solomon International Business School","Free Schools","Free Schools","All Through",93,96,3.2258064516129004E-2,8500,"",8774]
[330,"Birmingham",141969,4021,3304021,"Eden Boys' School, Birmingham","Free Schools","Free Schools","Secondary",100,100,0,8500,"",8500]
{"$rows_left_out":82}